program: Gaussian 09
title: 000232909
version: EM64L-G09RevD.01
frameworkgroup: C1[X(C19H33N)]
method: RPBEPBE
basis: SDD
operation: Freq
keyword: #pfreq=noraman
keyword: PBEPBE/SDD
title: #p freq=noraman PBEPBE/SDD
converged: YES YES NO NO
title: Mulliken charges:
elementType: N C C C C C C C C C C C C C C C C C C C H H H H H H H H H H H H H H H H H H H H H H H H H H H H H H H H H
charge: -0.298445 -0.386164 -0.384610 -0.384308 -0.382634 -0.382340 -0.370001 -0.372507 -0.397813 -0.353477 -0.371146 -0.356640 -0.481025 -0.696694 0.424544 -0.440374 -0.384044 -0.223166 -0.224068 -0.244222 0.194117 0.193385 0.193686 0.192569 0.192554 0.193165 0.192087 0.195054 0.192123 0.191775 0.191193 0.188551 0.189421 0.188979 0.216693 0.182625 0.187489 0.187707 0.175924 0.209523 0.194792 0.194569 0.248099 0.192659 0.221871 0.209671 0.209566 0.214863 0.230968 0.271540 0.223124 0.223060 0.225735
chargesum: 0.00000
title: Mulliken charges with hydrogens summed into heavy atoms:
elementType: N C C C C C C C C C C C C C C C C C C C
charge: -0.050346 0.001338 0.001646 0.001411 0.004506 0.001558 0.009743 0.005893 0.001505 0.021718 0.014301 0.032721 -0.066495 -0.062595 0.424544 -0.209406 -0.112504 -0.000042 -0.001009 -0.018487
polarizability: 2.95152328e+02 7.55329990e+00 1.92478546e+02 -1.19747875e+01 7.44109981e+00 1.52391382e+02
1716.lowfreq: -5.0437 -4.0473 -0.0018 0.0001 0.0011 6.3709 12.5905 14.7272 25.2397
frequency: 10.3332 14.6769 25.2150 28.0640 41.9056 46.0631 55.4350 73.9912 83.9585 85.9433 109.0422 113.8480 126.6698 133.6166 138.7981 145.6516 154.4575 156.5609 202.1073 224.1597 242.2341 256.6804 292.5947 350.9691 368.4348 405.5467 426.9324 445.8882 475.4413 493.9995 518.4052 596.9527 616.2734 687.0813 708.0299 719.7672 721.6610 726.9322 738.6474 748.2939 759.4629 793.4420 809.3416 835.4038 859.2028 885.4462 887.8062 914.4352 938.3227 964.3995 978.4742 981.3973 987.2076 988.1578 989.6455 996.8191 1011.7976 1023.2983 1026.4709 1029.4881 1048.4093 1054.3681 1072.5847 1077.4348 1079.1625 1081.0026 1081.7402 1095.6054 1124.9317 1141.7726 1144.8155 1169.3803 1180.0946 1181.0212 1197.6042 1202.2827 1212.1609 1220.2080 1230.2440 1239.8110 1254.9598 1259.9456 1272.8093 1276.5076 1279.7646 1283.6352 1287.6396 1288.7253 1294.3926 1295.5792 1301.8426 1314.5597 1330.8107 1341.2849 1351.3416 1353.7112 1356.5468 1357.5754 1378.0541 1389.4701 1392.3399 1439.9360 1448.6007 1458.9894 1459.1108 1462.3826 1462.7094 1465.2823 1467.2211 1471.5302 1474.9498 1476.0870 1477.4636 1481.6725 1484.5517 1486.4434 1488.4515 1496.3845 1593.5201 1614.6669 2840.0930 2855.0505 2948.5015 2948.5978 2950.2575 2950.7467 2952.1644 2954.2753 2957.3535 2961.1703 2964.9916 2967.0834 2968.1147 2971.4548 2981.3685 2984.1313 2988.2012 2988.5451 2994.5170 3002.4754 3012.5085 3022.7614 3032.1864 3040.1114 3045.4622 3067.9947 3069.7873 3112.8869 3122.7931 3136.3733 3150.4098 3162.1095 3429.4419
redmass: 3.4258 4.4263 3.1183 2.2117 4.0475 3.1289 1.7020 2.8910 3.7082 1.7419 2.5321 1.8235 4.5833 2.5986 1.8543 3.3974 2.0135 2.1865 3.6255 1.1307 3.4952 3.8353 3.2728 3.3273 3.7466 2.8487 3.0043 3.3031 3.1502 2.9442 3.2700 4.6539 6.2832 1.4004 1.8159 1.0584 1.0671 1.0813 1.1022 1.5537 1.1355 1.1769 3.8115 1.2101 1.2473 1.2271 1.8979 1.3395 1.2147 2.2737 2.9505 1.4544 1.5830 2.7851 6.1174 1.3678 2.7123 2.3645 1.7133 1.6340 2.5552 2.7355 2.6017 2.1000 1.7528 2.0501 2.1411 2.5673 3.0948 3.5960 1.4292 1.0609 1.2024 1.6526 1.4239 1.3965 2.3147 1.4492 1.3320 1.3598 1.2998 1.3077 1.1876 1.0544 1.0900 1.2091 1.1118 1.1252 1.1052 1.1183 1.3430 1.3443 1.3412 1.4262 1.5425 1.7190 1.6549 1.6341 2.6226 1.2178 2.3132 2.1249 1.2159 1.0746 1.0743 1.0706 1.0715 1.0667 1.0811 1.0922 1.2442 1.0621 1.1657 1.1592 1.3569 1.1486 1.0955 1.0932 6.1649 6.1388 1.0712 1.0713 1.0585 1.0585 1.0589 1.0591 1.0593 1.0604 1.0614 1.0606 1.0598 1.0856 1.0583 1.0369 1.0960 1.0969 1.0878 1.0938 1.1000 1.1020 1.1035 1.1042 1.1043 1.1041 1.1036 1.1006 1.0993 1.0863 1.0867 1.0923 1.0953 1.1009 1.0744
irintensity: 0.0188 0.0043 0.0410 0.0345 0.0550 0.1113 0.1845 0.2788 0.1495 0.7139 0.7073 1.1256 0.0248 0.2573 0.8610 1.0137 0.1761 1.3800 1.5481 0.0008 1.6588 0.2540 0.7705 0.5424 0.3772 0.2542 1.4807 3.0435 5.8716 1.1182 2.0193 3.0966 0.7146 72.1470 57.8707 18.6196 0.0582 7.3378 0.4470 64.4769 1.7781 0.5081 4.8765 0.6368 0.0982 1.4787 4.6677 5.0109 0.5246 7.7184 1.3072 0.1454 1.3268 0.8450 0.0042 1.3315 1.9466 13.8076 2.4267 0.0411 0.4232 2.3568 1.1965 4.7561 6.0412 1.1508 0.0483 11.6648 7.4308 63.0717 1.4882 0.4047 1.9349 0.2662 13.9666 7.5139 4.9808 2.7496 0.1644 1.5701 0.3870 0.3257 0.5587 0.0114 0.1102 1.9332 1.3486 0.1257 0.1337 0.1655 10.8434 1.4729 2.3131 8.5859 1.1770 0.5810 0.5646 0.7420 4.6931 11.3299 0.4957 10.0195 44.6528 0.0675 0.0040 0.3435 0.0224 0.5145 1.3785 5.7188 15.4827 12.4629 7.5785 0.0582 2.0450 2.6457 35.5311 6.8458 0.6347 7.8785 81.3997 130.8189 0.0041 0.0257 0.0641 0.9624 0.4436 1.2499 3.1819 2.5911 135.0070 26.6995 216.1348 35.6924 0.1086 0.1117 34.0836 15.6209 0.4585 0.1879 0.1791 1.5227 3.7018 55.0054 303.5940 98.5901 56.4468 8.4026 1.0272 29.9564 30.4301 22.1182 0.5548
temp: 298.150 k
press: 1.00000 atm
elementType: 7 6 6 6 6 6 6 6 6 6 6 6 6 6 6 6 6 6 6 6 1 1 1 1 1 1 1 1 1 1 1 1 1 1 1 1 1 1 1 1 1 1 1 1 1 1 1 1 1 1 1 1 1
symmnumber: 1
zpe: 1252557.6 jmol-1
zpe.correction: 0.477074 hartree
zpe.thermalcorrener: 0.501232 hartree
zpe.thermalcorrenthalpy: 0.502177 hartree
zpe.thermalcorrgfe: 0.417401 hartree
zpe.sumelectzpe: -796.966225 hartree
zpe.sumelectthermal: -796.942066 hartree
zpe.sumelectthermalent: -796.941122 hartree
zpe.sumelectthermalfe: -797.025898 hartree
dipole: -0.7401 -0.7785 -0.5965
dipole: 1.2286
quadrupole: -131.3175 -123.5335 -126.6663
quadrupole: -2.1889 -4.8908 2.1821
quadrupole: -4.1451 3.6390 0.5061 -2.1889 -4.8908 2.1821
hfenergy: -797.4432985 hartree
pointgroup: C01 [X(C19H33N1)]
dipole: -0.29455 -0.1875368 -0.3342469 debye
polarizability: 295.2394475|10.8341818|180.7849204|-8.6318035|19.6093757|163.9978876 unknown
InChI: InChI=1S/C19H33N/c1-2-3-4-5-6-7-8-9-10-14-17-20-18-19-15-12-11-13-16-19/h11-13,15-16,20H,2-10,14,17-18H2,1H3
charge 0 multiplicity 1
53 atoms
N  3.832083 -0.308307 -0.153138
C  -3.798313 0.287028 -0.00274
C  -2.575613 -0.656471 -0.054331
C  -5.149612 -0.462775 -0.000458
C  -1.222904 0.090663 -0.052374
C  -6.374269 0.478543 0.045275
C  -0.00351 -0.856438 -0.11464
C  -7.724616 -0.273266 0.048261
C  1.348777 -0.109464 -0.100393
C  -8.950661 0.666495 0.089908
C  2.559091 -1.059433 -0.180902
C  -10.30046 -0.087211 0.091407
C  5.046955 -1.147294 -0.233537
C  -11.519985 0.859004 0.131259
C  6.323719 -0.327263 -0.080001
C  7.478384 -0.64224 -0.838851
C  6.384213 0.747247 0.844356
C  8.676145 0.090442 -0.670338
C  7.578084 1.483386 1.011469
C  8.73001 1.156369 0.256978
H  -3.731667 0.924366 0.903968
H  -3.764571 0.978446 -0.870802
H  -2.611716 -1.350169 0.811799
H  -2.641741 -1.291468 -0.96286
H  -5.214091 -1.103259 -0.905229
H  -5.184528 -1.151558 0.869674
H  -1.188865 0.789251 -0.914619
H  -1.15258 0.71957 0.85964
H  -6.310293 1.119767 0.949477
H  -6.340252 1.166601 -0.825459
H  -0.043095 -1.559333 0.743755
H  -0.072604 -1.480071 -1.030724
H  -7.759541 -0.959639 0.92036
H  -7.787108 -0.916476 -0.854755
H  1.437933 0.498958 0.820704
H  1.38199 0.601005 -0.954172
H  -8.917182 1.353304 -0.781895
H  -8.890813 1.309515 0.993192
H  2.457298 -1.704903 -1.092052
H  2.547786 -1.744147 0.691656
H  -10.333169 -0.772669 0.963005
H  -10.358623 -0.730113 -0.810818
H  3.847015 0.441767 -0.858931
H  5.108425 -1.745715 -1.177744
H  4.982953 -1.887824 0.591615
H  -11.501693 1.490625 1.039683
H  -11.52524 1.534569 -0.745102
H  -12.471796 0.296314 0.130077
H  7.440599 -1.463886 -1.565575
H  5.482396 0.99397 1.414816
H  9.561126 -0.165456 -1.264368
H  7.612106 2.310888 1.729796
H  9.656223 1.727657 0.387281
