program: Gaussian 09
title: 000232944
version: EM64L-G09RevD.01
frameworkgroup: C1[X(C16H23N3O)]
method: RPBEPBE
basis: SDD
operation: Freq
keyword: #p
keyword: freq=noraman
keyword: PBEPBE/SDD
title: #p freq=noraman PBEPBE/SDD
converged: YES YES NO NO
title: Mulliken charges:
elementType: O N N N C C C C C C C C C C C C C C C C H H H H H H H H H H H H H H H H H H H H H H H
charge: -0.258522 -0.158509 -0.693893 -0.050898 -0.054106 -0.038816 -0.402017 -0.390886 -0.423119 -0.368843 -0.740395 -0.757553 -0.330019 0.212994 0.253168 -0.541623 0.515204 -0.339512 -0.450879 -0.239520 0.204255 0.201363 0.200680 0.201440 0.200628 0.202134 0.197483 0.216304 0.203930 0.251941 0.222359 0.215793 0.216259 0.255132 0.208379 0.219703 0.213108 0.228584 0.303295 0.251001 0.222692 0.311904 0.309381
chargesum: 0.00000
title: Mulliken charges with hydrogens summed into heavy atoms:
elementType: O N N N C C C C C C C C C C C C C C C C
charge: -0.258522 -0.158509 -0.072608 -0.050898 0.150149 0.162547 0.000102 0.011877 -0.009333 0.087028 -0.085984 -0.074339 0.111673 0.212994 0.253168 -0.238328 0.515204 -0.088511 -0.228188 -0.239520
polarizability: 2.37114585e+02 -1.92032478e+01 2.25011160e+02 1.13608875e+01 4.22130560e+00 1.37960050e+02
1716.lowfreq: -4.9507 -0.0003 0.0004 0.0008 3.4648 12.0765 16.3781 31.0206 43.1777
frequency: 16.2400 30.5712 42.7637 74.2984 86.3548 95.5709 98.6250 143.4712 165.5633 189.3639 199.1657 212.3370 230.8615 253.7511 255.6902 279.0535 297.4012 331.8846 348.0177 363.8409 388.7515 390.6163 405.3124 406.9252 429.5379 446.1260 449.3681 461.0061 491.7076 514.6530 533.7537 558.6964 600.2078 617.7453 636.9950 672.4976 701.6289 724.8736 748.8201 787.5408 805.0961 809.2684 838.8459 845.1121 884.5291 911.7742 917.9230 937.4063 946.2978 952.1784 957.1355 964.6621 1007.5846 1020.3544 1028.7653 1042.2206 1056.2493 1063.6162 1090.7650 1110.6866 1115.0770 1134.4781 1143.1717 1173.0168 1178.4917 1188.2602 1209.4198 1224.2234 1248.8506 1259.4547 1282.2504 1285.5741 1290.1032 1305.5954 1332.7441 1333.2480 1335.8392 1348.0437 1349.7376 1359.9622 1366.1002 1371.3472 1381.9321 1387.5985 1392.5824 1447.0675 1450.0973 1459.4022 1460.4129 1462.6423 1470.5817 1474.6656 1476.5978 1485.9757 1488.4845 1513.3050 1564.7332 1628.9791 1641.3817 2167.0785 2897.6735 2958.5361 2967.9889 2969.8886 2972.1930 2980.9074 2982.4235 2987.4835 2994.2509 3027.2977 3028.5708 3040.3303 3050.2657 3069.6973 3075.0518 3077.1299 3079.7383 3082.8231 3087.3531 3133.1578 3161.3936 3561.8496 3703.4125
redmass: 4.0234 4.3065 4.2319 4.3620 3.6882 5.4151 7.0273 2.5325 3.7447 2.9471 1.6570 1.3944 1.4295 2.7726 4.4539 2.1828 2.3435 2.4021 2.7797 2.2824 3.1613 1.2727 1.2858 3.1122 2.7497 3.4955 3.1070 3.1007 2.4302 7.0046 5.4675 2.7341 5.7400 2.1015 3.5726 3.1253 5.8396 5.6212 3.8994 2.6848 2.2438 1.5435 2.2625 1.8082 2.1913 1.4589 2.1670 1.8014 1.3696 1.8807 1.9025 1.8086 2.2492 1.4822 1.8780 1.6604 2.1734 1.9524 1.6712 2.5225 2.2348 2.1506 2.3271 2.5293 1.7884 1.5734 1.6050 2.3902 1.2747 1.2777 1.4994 1.2923 1.2267 1.2922 2.2125 1.4344 1.4506 1.4466 1.3656 1.3664 1.3531 1.3211 1.2655 4.7231 1.2221 1.6415 1.1810 1.0913 1.0839 1.5036 1.0764 1.0653 1.0536 1.0569 1.0584 3.2753 7.2320 3.8491 1.3196 12.6203 1.0712 1.0753 1.0659 1.0665 1.0643 1.0386 1.0479 1.0662 1.0631 1.0967 1.0994 1.1035 1.0950 1.0970 1.0949 1.0988 1.0967 1.0988 1.0999 1.0881 1.0969 1.0449 1.1041
irintensity: 2.7470 0.4414 1.5576 2.9960 1.4786 0.0867 1.3653 0.0999 0.2813 0.5025 1.9418 0.7645 1.0352 2.2025 5.8986 1.8520 0.5961 1.6307 2.0370 3.2814 5.6871 259.8799 2.0167 1.1144 3.6443 1.1371 2.7304 2.4820 1.6259 3.0183 3.2233 26.2724 2.1698 3.0342 8.3863 13.3925 0.3075 4.9453 0.3206 10.6493 1.6387 49.9783 5.6680 1.4615 2.5320 48.2008 13.5391 18.2923 1.2627 7.4579 6.6732 24.4008 28.4712 2.6218 11.5877 11.4489 14.0544 2.0421 2.4303 26.5180 111.4702 10.8936 11.3573 15.0361 45.6866 9.2229 31.8527 33.5547 3.7415 12.2942 46.4536 17.4748 11.3550 5.5752 89.6513 2.2448 3.0215 2.2650 0.7314 3.5945 7.3843 2.8416 24.8809 9.8887 16.7820 18.2909 13.1887 8.3361 4.5137 29.8784 13.5589 8.4188 12.7871 6.0317 7.4221 55.1607 78.2804 176.7936 308.7282 117.9038 66.7489 7.6847 21.0311 34.9876 27.4730 27.1447 41.4728 18.7573 55.8941 58.7466 39.7478 66.1823 79.9788 38.5419 3.6676 53.1008 32.7290 48.1709 24.6333 11.5965 13.4607 77.2407 27.6814
temp: 298.150 k
press: 1.00000 atm
elementType: 8 7 7 7 6 6 6 6 6 6 6 6 6 6 6 6 6 6 6 6 1 1 1 1 1 1 1 1 1 1 1 1 1 1 1 1 1 1 1 1 1 1 1
symmnumber: 1
zpe: 956713.4 jmol-1
zpe.correction: 0.364393 hartree
zpe.thermalcorrener: 0.384687 hartree
zpe.thermalcorrenthalpy: 0.385631 hartree
zpe.thermalcorrgfe: 0.315089 hartree
zpe.sumelectzpe: -861.431691 hartree
zpe.sumelectthermal: -861.411397 hartree
zpe.sumelectthermalent: -861.410453 hartree
zpe.sumelectthermalfe: -861.480995 hartree
dipole: -7.3392 6.1295 -0.4490
dipole: 9.5727
quadrupole: -136.8399 -117.8895 -120.0823
quadrupole: 26.4066 2.3684 2.7990
quadrupole: -11.9026 7.0477 4.8550 26.4066 2.3684 2.7990
hfenergy: -861.7960838 hartree
pointgroup: C01 [X(C16H23N3O1)]
dipole: 1.697094 -1.1075596 3.1744724 debye
polarizability: 216.7497693|-26.3344328|148.4125913|12.3297199|-22.7024589|234.9234345 unknown
InChI: InChI=1S/C16H23N3O/c1-12-4-3-5-13(2)19(12)8-9-20-16-10-15(18)7-6-14(16)11-17/h6-7,10,12-13H,3-5,8-9,18H2,1-2H3
charge 0 multiplicity 1
43 atoms
O  -0.632463 -0.087549 -2.386596
N  1.718997 -0.566487 0.031797
N  -2.45806 -0.349389 2.159741
N  -3.164025 1.244938 -4.494662
C  2.262415 -1.909968 0.441481
C  2.331684 0.559374 0.821052
C  3.82226 -1.94992 0.390675
C  3.884206 0.568142 0.731945
C  4.463169 -0.791141 1.191711
C  1.705658 -0.400371 -1.446102
C  1.705041 -2.352225 1.813738
C  1.716754 1.928462 0.472379
C  0.473825 -1.039696 -2.128897
C  -1.650803 0.082681 -1.445222
C  -2.868677 0.64087 -1.952154
C  -1.512513 -0.242167 -0.083779
C  -2.599446 -0.032505 0.811244
C  -3.938423 0.850841 -1.037903
C  -3.822003 0.517403 0.319022
C  -3.0144 0.966194 -3.33904
H  1.881223 -2.635328 -0.305624
H  2.067661 0.348784 1.878746
H  4.151741 -1.874661 -0.665909
H  4.179172 -2.929093 0.764744
H  4.286816 1.392087 1.353254
H  4.189796 0.774272 -0.314873
H  4.269952 -0.923736 2.27591
H  5.562323 -0.808324 1.064903
H  2.616863 -0.83397 -1.921996
H  1.700723 0.670642 -1.707835
H  2.018905 -3.388318 2.036758
H  0.600272 -2.322898 1.80121
H  2.058825 -1.713422 2.641984
H  0.615916 1.863875 0.413642
H  2.093355 2.330989 -0.486074
H  1.980687 2.66153 1.256124
H  0.094495 -1.903312 -1.548403
H  0.743799 -1.374931 -3.145193
H  -0.53294 -0.585356 0.281198
H  -4.873572 1.275123 -1.41751
H  -4.663587 0.684125 1.000563
H  -1.588035 -0.737852 2.512554
H  -3.216386 -0.187314 2.8158
