program: Gaussian 09
title: 000232907
version: EM64L-G09RevD.01
frameworkgroup: C1[X(C15H33N)]
method: RPBEPBE
basis: SDD
operation: Freq
keyword: #pfreq=noraman
keyword: PBEPBE/SDD
title: #p freq=noraman PBEPBE/SDD
converged: YES YES NO NO
title: Mulliken charges:
elementType: N C C C C C C C C C C C C C C C H H H H H H H H H H H H H H H H H H H H H H H H H H H H H H H H H
charge: -0.563432 -0.137191 -0.415097 -0.417072 -0.390560 -0.391176 -0.370867 -0.384163 -0.376312 -0.372474 -0.350771 -0.354250 -0.357663 -0.356370 -0.695909 -0.696764 0.212183 0.187444 0.202978 0.191637 0.219610 0.177674 0.209112 0.200467 0.193569 0.187142 0.192013 0.191629 0.194452 0.190309 0.187855 0.189765 0.187814 0.186975 0.188167 0.188859 0.187536 0.257956 0.257079 0.195201 0.194648 0.195034 0.194268 0.209785 0.215170 0.209508 0.214686 0.209542 0.210003
chargesum: 0.00000
title: Mulliken charges with hydrogens summed into heavy atoms:
elementType: N C C C C C C C C C C C C C C C
charge: -0.048397 0.074992 -0.024676 -0.005824 -0.003774 0.002861 0.008288 0.001918 0.001852 0.005106 0.024371 0.022144 0.032186 0.032932 -0.061447 -0.062532
polarizability: 1.96511082e+02 -1.86559906e+00 1.72441297e+02 -8.12193252e-01 -5.71788635e-01 1.46694721e+02
1716.lowfreq: -13.6300 -0.0006 0.0009 0.0011 4.7376 11.4232 16.2072 26.5203 38.8599
frequency: 11.1109 23.7424 38.7147 47.4852 53.5711 62.8750 72.9049 91.5201 99.9186 111.8198 122.3657 139.4075 143.7377 157.0188 162.5985 177.3246 216.3715 221.9311 227.1280 236.3565 264.9633 291.8294 297.9300 378.8198 387.3390 418.2995 451.5640 466.3959 499.0754 572.2729 656.2198 719.2886 721.2452 729.4824 730.3621 757.0352 762.7743 806.1332 824.6328 836.9550 887.0054 887.9963 900.9853 915.5107 971.6879 980.0219 991.3955 1001.6725 1018.1354 1019.0697 1028.5580 1037.1070 1048.2903 1058.5217 1070.9666 1077.3431 1084.6859 1086.0210 1105.5177 1109.8762 1131.8962 1154.9993 1181.0688 1188.1204 1196.4310 1216.9674 1228.9120 1235.6499 1239.1119 1260.5349 1270.0113 1273.7894 1276.4544 1282.1305 1283.5593 1291.2561 1292.7684 1294.6654 1296.9282 1305.9734 1310.5838 1325.7804 1340.1938 1348.0337 1352.2915 1355.2155 1356.8561 1365.2714 1376.5179 1386.2725 1388.2741 1459.5764 1460.3928 1460.9804 1462.0814 1464.1429 1465.8138 1469.2194 1470.5457 1474.8237 1476.2105 1477.6764 1478.3333 1483.0875 1485.1582 1488.0027 1489.3276 1634.5435 2946.3126 2947.5402 2948.9337 2949.8584 2950.1772 2952.7464 2953.4003 2957.0067 2959.7994 2961.7677 2967.1036 2968.0665 2970.9789 2971.1334 2974.3917 2982.8615 2982.9198 2990.0134 2991.4147 2999.6959 3003.1187 3012.0006 3018.8168 3026.1673 3032.8069 3038.7059 3043.2452 3067.5634 3067.8698 3069.3999 3070.1630 3423.4690 3550.2215
redmass: 3.0815 1.7047 2.8990 1.6967 3.3926 3.1071 3.3110 2.0247 1.8383 1.9702 2.3913 2.1274 2.0339 3.0460 2.3300 2.2030 2.9156 1.2171 3.3270 1.1049 1.3392 2.2075 3.0546 2.4687 2.9266 2.9183 2.9290 2.7564 2.9131 1.9015 1.5732 1.0634 1.0634 1.0934 1.1062 1.2131 1.1730 1.7226 1.3826 1.5155 1.8705 1.8875 1.3086 1.2737 2.3414 1.5061 1.3556 3.5115 3.2387 2.5069 1.8895 1.7750 1.6335 2.5686 2.4823 2.1486 2.3712 2.0932 1.8414 2.0644 2.3789 2.1815 1.7839 1.6922 1.5616 1.3779 1.3543 1.3762 1.3447 1.3114 1.2719 1.2289 1.2887 1.0359 1.0390 1.1569 1.1453 1.0874 1.0931 1.3335 1.3524 1.3345 1.4373 1.4937 1.6783 1.6254 1.6213 1.4398 1.5645 1.2168 1.2175 1.0746 1.0724 1.0749 1.0706 1.0715 1.0726 1.0803 1.0750 1.0453 1.0766 1.0716 1.0485 1.0848 1.0862 1.0899 1.0946 1.0936 1.0625 1.0600 1.0588 1.0599 1.0588 1.0602 1.0601 1.0622 1.0597 1.0624 1.0590 1.0587 1.0364 1.0368 1.0792 1.0957 1.0960 1.0966 1.0981 1.0992 1.1007 1.1024 1.1023 1.1039 1.1028 1.1043 1.1026 1.1007 1.1007 1.0993 1.0993 1.0443 1.0964
irintensity: 0.0011 0.0018 0.0838 0.0103 0.0361 0.0424 0.0380 0.1306 0.0365 0.1729 0.0423 0.1651 0.0190 0.1191 0.3797 1.9708 0.2230 0.0827 2.0632 0.0023 39.4841 15.1398 0.6940 2.3574 8.6262 3.3286 0.0359 2.0029 10.0776 68.7549 218.9106 13.9906 12.3281 0.2780 2.2617 6.2471 4.2503 0.3090 2.1154 1.8834 3.7783 4.5611 2.4042 2.7074 3.2180 0.7829 0.8262 0.4959 4.2688 3.7684 2.1433 0.2607 1.5467 0.6887 0.0129 0.1881 0.8592 1.3614 4.6837 13.9778 11.1839 6.2917 6.2875 1.9447 6.4083 6.9245 4.8158 3.5765 0.8930 0.8128 1.8405 3.1097 0.6863 0.2428 0.4718 0.4719 0.2173 1.1421 0.4192 5.5205 0.5790 2.7312 0.2077 0.5139 0.3624 1.8753 0.8129 3.5856 9.2872 11.0985 11.5311 0.1132 0.0711 1.0631 0.1932 0.2104 1.0095 3.4878 4.4857 11.7979 4.0876 1.3252 11.5757 7.6126 1.2704 31.5923 16.7663 30.8295 2.3477 2.4710 0.1385 2.0619 0.3208 1.8913 2.2406 11.1164 37.5196 31.4678 113.4920 139.2195 41.8616 29.9798 135.7268 5.6095 1.1493 7.2420 0.2541 7.7127 0.1877 12.2611 1.0180 11.1245 13.8460 188.8391 193.9953 97.2934 95.3631 55.0087 55.5304 5.8035 0.2878
temp: 298.150 k
press: 1.00000 atm
elementType: 7 6 6 6 6 6 6 6 6 6 6 6 6 6 6 6 1 1 1 1 1 1 1 1 1 1 1 1 1 1 1 1 1 1 1 1 1 1 1 1 1 1 1 1 1 1 1 1 1
symmnumber: 1
zpe: 1190445.8 jmol-1
zpe.correction: 0.453417 hartree
zpe.thermalcorrener: 0.475644 hartree
zpe.thermalcorrenthalpy: 0.476588 hartree
zpe.thermalcorrgfe: 0.398369 hartree
zpe.sumelectzpe: -644.774199 hartree
zpe.sumelectthermal: -644.751972 hartree
zpe.sumelectthermalent: -644.751028 hartree
zpe.sumelectthermalfe: -644.829247 hartree
dipole: -1.0415 -0.7021 0.3397
dipole: 1.3012
quadrupole: -105.3232 -111.3443 -105.6205
quadrupole: -5.1407 2.1028 2.6637
quadrupole: 2.1062 -3.9149 1.8088 -5.1407 2.1028 2.6637
hfenergy: -645.2276158 hartree
pointgroup: C01 [X(C15H33N1)]
dipole: 0.4078288 0.2779035 0.1360968 debye
polarizability: 196.5142468|-1.7712936|172.4265966|1.1102527|0.5635093|146.7062561 unknown
InChI: InChI=1S/C15H33N/c1-3-5-7-9-11-13-15(16)14-12-10-8-6-4-2/h15H,3-14,16H2,1-2H3
charge 0 multiplicity 1
49 atoms
N  0.579919 -3.949686 -0.638641
C  0.004254 -2.916388 0.262124
C  1.069766 -1.974154 0.908927
C  -1.106479 -2.165155 -0.512172
C  1.834854 -1.064164 -0.078642
C  -1.886607 -1.125936 0.32243
C  2.984166 -0.287213 0.603149
C  -3.079808 -0.510425 -0.443924
C  3.768857 0.636534 -0.355696
C  -3.850464 0.546152 0.37935
C  4.928331 1.385204 0.339878
C  -5.041631 1.171371 -0.381307
C  5.723414 2.310523 -0.6096
C  -5.806085 2.23081 0.445179
C  6.884097 3.043448 0.097587
C  -6.993309 2.853205 -0.321383
H  -0.48764 -3.464905 1.092834
H  1.802655 -2.611768 1.448338
H  0.58446 -1.34437 1.682752
H  -0.666515 -1.666841 -1.402419
H  -1.806228 -2.930041 -0.901405
H  2.254878 -1.679351 -0.903012
H  1.134641 -0.343977 -0.549183
H  -1.210205 -0.307957 0.644959
H  -2.259194 -1.606541 1.251598
H  3.685659 -1.012813 1.066564
H  2.571983 0.317811 1.438036
H  -2.711805 -0.046598 -1.383388
H  -3.775969 -1.31894 -0.749787
H  3.073715 1.374528 -0.808283
H  4.173071 0.034559 -1.19663
H  -4.21901 0.081041 1.317818
H  -3.150249 1.351249 0.687132
H  5.621508 0.645441 0.793019
H  4.524543 1.98644 1.181489
H  -5.745513 0.368943 -0.68684
H  -4.674839 1.636053 -1.32067
H  0.961004 -3.556773 -1.508237
H  1.26951 -4.554262 -0.175978
H  5.032381 3.053888 -1.057239
H  6.12215 1.710169 -1.452899
H  -6.172665 1.765343 1.383014
H  -5.101316 3.031044 0.751081
H  6.508318 3.674202 0.925437
H  7.437896 3.69752 -0.600944
H  7.603905 2.321564 0.528021
H  -7.522825 3.606383 0.290933
H  -6.648751 3.351554 -1.247321
H  -7.726933 2.077673 -0.612449
