program: Gaussian 09
title: 000232890
version: EM64L-G09RevD.01
frameworkgroup: C1[X(C9H14O4)]
method: RPBEPBE
basis: SDD
operation: Freq
keyword: #pfreq=noraman
keyword: PBEPBE/SDD
title: #p freq=noraman PBEPBE/SDD
converged: NO YES NO NO
title: Mulliken charges:
elementType: O O O O C C C C C C C C C H H H H H H H H H H H H H H
charge: -0.413658 -0.416619 -0.236230 -0.230359 -0.066714 -0.185346 -0.204400 -0.420213 -0.443050 -0.408916 -0.745829 0.112575 0.131282 0.258364 0.276305 0.262582 0.198495 0.220996 0.255089 0.234260 0.201283 0.205909 0.228795 0.216546 0.216837 0.373110 0.378909
chargesum: 0.00000
title: Mulliken charges with hydrogens summed into heavy atoms:
elementType: O O O O C C C C C C C C C
charge: -0.040549 -0.037710 -0.236230 -0.230359 0.191650 0.090958 0.058182 -0.000722 0.046298 -0.001723 -0.083651 0.112575 0.131282
polarizability: 1.14441898e+02 3.13569245e+00 9.44452524e+01 -2.98734245e+00 -2.07652485e+00 1.02654058e+02
1716.lowfreq: 0.0004 0.0006 0.0007 10.2934 15.6078 21.5599 35.9162 41.7073 86.8804
frequency: 35.8736 41.5204 86.8454 109.9085 145.2261 151.0292 215.8197 227.2739 261.1207 291.7615 321.6158 342.0732 375.1293 419.7501 441.6497 508.8407 529.5529 572.0729 613.8235 632.7425 651.8153 702.4190 729.9911 766.2369 804.6486 858.1887 861.5761 886.6890 930.1125 948.5341 975.5019 996.1629 1033.0018 1048.8877 1067.2091 1091.7328 1105.8524 1110.5277 1138.5997 1167.2379 1204.2158 1231.9867 1250.9839 1252.0430 1271.8056 1295.2793 1312.8101 1315.7415 1337.4254 1345.0376 1359.6518 1367.5364 1381.1556 1394.6018 1462.0478 1468.0971 1473.2368 1474.5331 1481.3837 1643.9332 1652.5911 2966.3345 2973.5955 2978.1070 2985.7159 2992.3945 3018.0924 3034.0630 3042.3049 3049.5005 3067.2142 3078.1384 3082.7153 3495.8684 3515.0028
redmass: 10.3247 8.9011 4.5907 3.2971 5.0451 4.6027 2.0050 1.2757 4.2392 2.9388 3.5306 3.4032 3.0057 3.8358 2.5467 2.2777 4.1185 2.1273 1.6779 1.8005 2.2250 3.1955 3.1331 4.2275 2.5581 2.7335 2.3999 1.7213 2.3636 2.5960 1.6260 1.6787 2.6084 2.3081 1.8275 1.8666 1.5118 2.2129 2.6138 1.3010 1.6426 1.4273 1.4881 1.4306 1.4227 1.4790 1.3206 1.2587 1.6479 1.4230 1.4547 1.4893 1.7635 1.2125 1.0840 1.0835 1.0591 1.0798 1.0560 8.4404 7.9471 1.0642 1.0380 1.0604 1.0812 1.0826 1.0674 1.0937 1.0987 1.0848 1.0986 1.0997 1.1039 1.0637 1.0640
irintensity: 1.7142 1.0071 0.5110 0.1179 2.9948 1.3806 0.3098 0.1210 0.2892 0.9737 5.1449 2.1036 1.7446 1.9520 0.8084 12.4448 44.4705 92.6649 61.4901 84.4450 62.8549 13.0210 31.9381 4.8858 1.5858 1.8634 5.8221 16.7728 13.0500 12.1677 27.6814 9.6743 154.3580 352.4759 37.0559 2.4847 37.5498 0.1888 2.8068 4.5932 10.4455 2.3547 5.2140 2.4783 5.6883 32.3239 19.8180 3.4353 18.0636 0.8602 7.8685 3.8891 16.0307 11.5973 8.1320 13.4044 15.5360 6.6917 16.7764 345.8261 16.5308 37.2713 17.4004 38.1576 9.8569 9.3961 19.4310 39.5988 44.6269 3.9323 49.3203 29.8807 15.6275 21.8521 27.4942
temp: 298.150 k
press: 1.00000 atm
elementType: 8 8 8 8 6 6 6 6 6 6 6 6 6 1 1 1 1 1 1 1 1 1 1 1 1 1 1
symmnumber: 1
zpe: 582902.6 jmol-1
zpe.correction: 0.222016 hartree
zpe.thermalcorrener: 0.235104 hartree
zpe.thermalcorrenthalpy: 0.236048 hartree
zpe.thermalcorrgfe: 0.181935 hartree
zpe.sumelectzpe: -651.257434 hartree
zpe.sumelectthermal: -651.244346 hartree
zpe.sumelectthermalent: -651.243402 hartree
zpe.sumelectthermalfe: -651.297515 hartree
dipole: 0.4132 0.0437 -0.1191
dipole: 0.4322
quadrupole: -67.4936 -74.1119 -86.8496
quadrupole: 1.9333 -1.7983 2.4925
quadrupole: 8.6581 2.0398 -10.6979 1.9333 -1.7983 2.4925
hfenergy: -651.4794498 hartree
pointgroup: C01 [X(C9H14O4)]
dipole: 0.1585376 0.0266408 -0.0554044 debye
polarizability: 113.6175341|4.2568517|94.8243199|-3.4997004|-2.2401868|103.0993543 unknown
InChI: InChI=1S/C9H14O4/c1-5-3-2-4-6(8(10)11)7(5)9(12)13/h5-7,10,12H,2-4H2,1H3
charge 0 multiplicity 1
27 atoms
O  -2.367848 -2.033003 0.330105
O  3.256411 -0.641458 -0.32744
O  -1.973033 -0.77463 -1.571046
O  2.106833 -0.514906 1.677934
C  -0.749771 0.862271 0.979973
C  -0.449661 -0.568047 0.393253
C  0.845192 -0.577843 -0.476071
C  -0.716772 1.954406 -0.116559
C  0.887433 0.57263 -1.529853
C  0.622513 1.951876 -0.888847
C  -2.064409 0.893299 1.788028
C  -1.630128 -1.092507 -0.40714
C  2.075702 -0.561576 0.427215
H  0.08765 1.054603 1.680507
H  -0.313946 -1.248659 1.251652
H  0.909034 -1.534245 -1.034951
H  -0.880551 2.940706 0.360225
H  -1.552075 1.796362 -0.827845
H  0.103735 0.362375 -2.27916
H  1.865575 0.552947 -2.040942
H  1.450003 2.217638 -0.198112
H  0.607855 2.72568 -1.679618
H  -2.0957 0.086907 2.542957
H  -2.165233 1.860561 2.31371
H  -2.947989 0.776685 1.13207
H  -3.147125 -2.332415 -0.214973
H  4.035904 -0.651956 0.291828
