program: Gaussian 09
title: 000232895
version: EM64L-G09RevD.01
frameworkgroup: C1[X(C19H12O2)]
method: RPBEPBE
basis: SDD
operation: Freq
keyword: #pfreq=noraman
keyword: PBEPBE/SDD
title: #p freq=noraman PBEPBE/SDD
converged: YES YES NO NO
title: Mulliken charges:
elementType: O O C C C C C C C C C C C C C C C C C C C H H H H H H H H H H H H
charge: -0.227817 -0.192999 0.128027 0.265594 0.197506 0.253325 0.317777 -0.164224 -0.254806 0.423305 -0.433229 -0.505718 -0.472166 -0.377643 0.459590 -0.361958 -0.427975 -0.433414 -0.247931 -0.240534 -0.806928 0.294392 0.293040 0.247748 0.288610 0.316274 0.243820 0.245449 0.233008 0.233668 0.240080 0.226673 0.239453
chargesum: 0.00000
title: Mulliken charges with hydrogens summed into heavy atoms:
elementType: O O C C C C C C C C C C C C C C C C C C C
charge: -0.227817 -0.192999 0.128027 0.265594 0.197506 0.253325 0.317777 -0.164224 -0.254806 0.423305 -0.138837 -0.212678 -0.224418 -0.089033 0.459590 -0.045684 -0.184155 -0.187965 -0.014923 -0.006865 -0.100722
polarizability: 3.70668528e+02 -8.75718541e+00 2.48687462e+02 -4.29355044e-02 -1.59284501e-02 8.25064094e+01
1716.lowfreq: -23.8745 -0.0007 -0.0004 0.0004 3.8991 6.9692 11.7457 32.0633 56.4734
frequency: -23.7304 32.0314 56.4410 101.6822 107.7234 145.6897 148.5931 206.7324 237.6504 246.6312 288.6485 302.3827 338.7282 356.3875 392.3256 395.9950 424.6678 430.8498 459.2522 474.6441 506.4755 522.1185 537.7853 565.2191 588.8533 627.1363 647.2759 664.2847 702.5078 708.3037 739.7168 754.9671 778.7630 784.8401 841.2567 850.3825 850.5187 857.1838 902.3848 909.7103 927.7292 958.8587 982.8457 987.5457 1000.4177 1003.6959 1014.8252 1019.2496 1037.5642 1051.9324 1054.5827 1113.9697 1144.8543 1159.5223 1175.2501 1191.4272 1197.6194 1233.3738 1241.2398 1272.5898 1281.3869 1313.1783 1342.5815 1384.2709 1401.3979 1402.5174 1410.9303 1417.3253 1424.8851 1451.1613 1468.2148 1475.6788 1487.5831 1508.1638 1526.9470 1543.0137 1560.9393 1594.8967 1598.7534 1615.4875 1624.9525 2981.8884 3061.0066 3091.2039 3125.1749 3131.3540 3134.6267 3139.2704 3146.9111 3160.6470 3163.1464 3167.7094 3199.2189
redmass: 1.0404 6.7752 4.8806 4.7315 5.7869 4.4418 4.7104 4.4304 4.7987 4.9163 6.3238 4.7099 8.2784 4.7928 6.2506 3.6555 3.1531 5.4284 12.1704 4.2916 3.5936 6.7437 3.4854 6.5920 6.1440 3.9205 6.7108 7.1451 3.7573 6.6591 2.4561 6.0831 1.7847 2.9793 5.9568 5.7304 1.6686 1.3396 2.1061 1.8062 4.7459 1.6787 1.3830 3.4139 1.3861 1.7008 1.4014 1.3212 2.3297 1.6013 3.1597 2.1718 1.5179 1.3602 1.1838 2.2137 1.8754 2.0148 1.8008 1.6749 1.9781 4.7522 3.8903 3.6093 1.4918 3.1603 4.3872 5.4715 3.0501 2.3653 1.0455 1.1282 3.4100 3.8748 7.9252 8.7167 7.2734 8.0492 6.3447 6.5487 6.7880 1.0374 1.0973 1.0991 1.0868 1.0895 1.0894 1.0912 1.0915 1.0988 1.0957 1.0954 1.0942
irintensity: 0.8465 4.8528 0.1359 0.2515 1.9461 1.0739 0.0037 2.1790 1.5249 0.0648 0.2530 0.6525 5.3684 0.9952 13.4024 0.8944 0.2872 9.8712 1.0486 10.0708 14.1114 0.0454 2.2685 5.8102 9.2125 1.8407 3.5184 4.9009 5.1871 2.8980 0.0001 3.0879 59.8040 29.0831 3.7976 10.9494 38.8046 3.5156 3.8434 32.2228 10.6706 0.2820 4.7285 32.5781 3.7081 6.6513 0.2676 2.1416 21.4946 15.7626 13.1610 0.9120 15.2508 10.4121 25.7591 10.7598 83.9956 9.6410 12.5989 10.1164 97.6632 522.1499 20.7670 3.7327 25.0846 3.4448 18.1817 23.5931 25.0296 65.7251 14.5626 14.4442 6.6878 53.2943 16.7993 227.6102 7.0974 11.7745 4.7113 25.2758 9.7170 24.0313 14.4572 20.3252 0.4049 8.6852 15.1261 21.2022 3.8281 35.3587 11.6755 8.0516 24.9257
temp: 298.150 k
press: 1.00000 atm
elementType: 8 8 6 6 6 6 6 6 6 6 6 6 6 6 6 6 6 6 6 6 6 1 1 1 1 1 1 1 1 1 1 1 1
symmnumber: 1
zpe: 655507.3 jmol-1
zpe.correction: 0.249670 hartree
zpe.thermalcorrener: 0.264782 hartree
zpe.thermalcorrenthalpy: 0.265726 hartree
zpe.thermalcorrgfe: 0.207116 hartree
zpe.sumelectzpe: -880.305799 hartree
zpe.sumelectthermal: -880.290687 hartree
zpe.sumelectthermalent: -880.289743 hartree
zpe.sumelectthermalfe: -880.348352 hartree
dipole: 0.0198 -1.0937 0.0056
dipole: 1.0939
quadrupole: -83.8242 -124.2138 -125.0165
quadrupole: 6.8935 -0.0289 0.0034
quadrupole: 27.1940 -13.1956 -13.9983 6.8935 -0.0289 0.0034
hfenergy: -880.5554684 hartree
pointgroup: C01 [X(C19H12O2)]
dipole: 0.0158981 0.4300785 -0.0038558 debye
polarizability: 370.9331846|6.4322124|248.3970259|-2.6077477|-0.6634491|82.532189 unknown
InChI: InChI=1S/C19H12O2/c1-11-6-8-14-16(10-11)19(21)17-13-5-3-2-4-12(13)7-9-15(17)18(14)20/h2-10H,1H3
charge 0 multiplicity 1
33 atoms
O  -0.184501 2.296852 0.05283
O  -1.193626 -3.116526 0.083058
C  0.760708 0.042403 0.053053
C  0.446983 -1.344679 0.060406
C  2.159517 0.451417 0.039026
C  -1.777911 0.518372 0.074735
C  -2.066792 -0.873671 0.082859
C  -0.366339 1.034191 0.059613
C  -0.962443 -1.863505 0.075951
C  3.187613 -0.578668 0.032712
C  1.476547 -2.334985 0.053668
C  -2.839968 1.451016 0.081189
C  2.813906 -1.961157 0.040051
C  -3.413252 -1.308801 0.097641
C  -4.191688 1.027731 0.095547
C  2.598339 1.821422 0.031164
C  -4.461522 -0.368834 0.104074
C  4.573507 -0.214534 0.019235
C  3.95898 2.143931 0.018221
C  4.960289 1.125334 0.012096
C  -5.318585 2.042728 0.099697
H  1.166466 -3.383867 0.059869
H  -2.584524 2.516189 0.074775
H  3.60413 -2.720973 0.034712
H  -3.609431 -2.385561 0.104126
H  1.844591 2.60872 0.03542
H  -5.501951 -0.713392 0.115806
H  5.324911 -1.012815 0.014728
H  4.260543 3.197245 0.012656
H  6.020994 1.398477 0.001824
H  -5.286888 2.675737 -0.806811
H  -6.306865 1.554335 0.137731
H  -5.240138 2.722068 0.968737
