program: Gaussian 09
title: 000232894
version: EM64L-G09RevD.01
frameworkgroup: C1[X(C15H18O3)]
method: RPBEPBE
basis: SDD
operation: Freq
keyword: #pfreq=noraman
keyword: PBEPBE/SDD
title: #p freq=noraman PBEPBE/SDD
converged: YES YES NO NO
title: Mulliken charges:
elementType: O O O C C C C C C C C C C C C C C C H H H H H H H H H H H H H H H H H H
charge: -0.174224 -0.265575 -0.242018 -0.059210 -0.366647 -0.453236 -0.417135 -0.513270 0.146850 -0.549832 0.498897 0.228894 -0.445972 -0.354750 -0.229038 -0.251002 -0.243406 -0.504738 0.252003 0.225641 0.247703 0.188074 0.222154 0.217925 0.246395 0.215133 0.281413 0.239800 0.227053 0.238383 0.224133 0.224874 0.227230 0.242753 0.234450 0.240296
chargesum: 0.00000
title: Mulliken charges with hydrogens summed into heavy atoms:
elementType: O O O C C C C C C C C C C C C C C C
charge: -0.174224 -0.265575 -0.242018 0.192793 -0.141006 -0.017460 0.022945 -0.051743 0.146850 -0.028619 0.498897 0.228894 -0.218920 -0.116366 -0.004905 -0.026128 -0.016177 0.212760
polarizability: 1.67782543e+02 -1.88063270e+01 1.76942052e+02 5.59925402e+00 2.85652529e+00 1.43423319e+02
1716.lowfreq: -10.8047 -0.0004 -0.0002 0.0002 5.6382 9.4004 24.3682 36.0773 43.3836
frequency: 24.1382 35.9740 43.3335 48.4793 79.3962 88.4084 96.2998 112.1374 153.5905 170.7689 211.2785 227.5830 252.3904 275.3985 292.6002 343.8246 367.9523 398.0091 403.8209 456.5935 495.1996 511.4086 547.2772 563.5249 616.0321 633.9354 648.5816 677.6643 703.5236 755.4235 791.3632 809.6385 831.8632 845.5807 849.2494 865.6269 902.6691 917.0811 927.2234 947.2271 964.5921 971.4220 990.5080 993.6590 1021.7604 1029.0217 1050.8430 1074.2044 1085.1677 1089.7904 1112.1827 1120.8225 1127.2268 1147.5683 1153.8277 1172.1313 1190.2921 1191.7008 1205.9895 1213.2702 1230.0916 1261.7799 1281.6580 1287.6438 1299.5297 1314.4114 1336.4231 1340.1254 1344.3722 1355.2987 1383.8007 1421.7490 1435.7372 1442.1826 1447.2466 1452.6685 1463.7823 1464.3951 1471.8832 1484.7626 1592.9615 1613.4399 1631.9377 1641.1981 2948.4586 2959.8903 2979.2254 2989.0588 2990.4418 2997.0713 3004.5640 3044.6854 3049.9201 3053.0994 3079.4432 3106.0570 3110.8387 3125.9677 3138.2216 3149.3922 3150.3764 3164.5718
redmass: 4.9110 4.4310 4.8444 5.2623 3.8786 2.9514 1.1774 3.4431 4.5862 3.6854 5.2089 3.9627 2.1100 4.6626 4.6526 3.2966 2.9426 2.8752 2.7938 2.7329 3.7109 3.7283 3.3527 3.2070 6.3014 5.0297 4.1061 3.6169 1.6600 2.0686 3.2763 2.5009 3.4657 1.5865 1.2741 2.9108 2.9034 1.5389 2.3061 2.4500 4.0931 1.3987 3.2718 1.6296 2.1581 2.1445 1.6830 1.6251 2.6850 1.7881 1.2714 2.4303 2.6082 1.4494 1.8107 1.0583 1.2691 1.2780 1.4044 2.0340 1.3796 1.3294 1.4291 1.4959 1.4065 1.3375 1.4382 1.4268 1.5170 1.5665 7.2123 1.1907 1.1508 1.8704 1.1192 1.0503 1.0708 1.0673 1.0890 2.3304 5.9937 6.2856 9.5111 8.9299 1.0805 1.0662 1.0647 1.0615 1.0629 1.0795 1.0298 1.0955 1.0998 1.1006 1.0985 1.1045 1.0876 1.0860 1.0914 1.1048 1.0958 1.1013
irintensity: 0.6480 0.8661 0.4866 1.2529 0.8529 1.7025 0.3539 0.7045 5.4627 6.1510 1.4140 4.8564 1.3335 11.6492 6.6917 2.5587 1.4824 2.2025 0.1531 0.2105 9.3199 2.9617 21.5919 6.7459 0.9270 1.4626 8.1880 9.4054 58.4376 26.1025 5.1103 2.5247 3.9630 9.0169 1.0258 9.1619 2.7872 5.5432 7.6172 4.6508 33.0353 0.0839 0.4927 0.0520 44.4016 4.9518 2.7835 24.2970 3.8521 36.8912 0.7015 9.9106 188.2545 8.1508 24.5340 0.3977 44.5379 40.0215 30.6672 8.1475 3.4119 19.6593 4.7735 37.7788 16.1705 4.2915 27.8252 11.1697 9.4997 22.0041 0.7293 23.7117 24.4645 6.7851 11.5927 14.3719 3.1668 17.3903 10.6365 15.3424 1.0214 6.5086 127.4042 146.6973 11.4826 21.6790 16.2816 36.3152 9.4213 24.6188 31.9540 28.1626 4.2730 49.8064 24.3868 25.6591 10.0719 0.1103 22.6429 14.4129 39.8368 16.9985
temp: 298.150 k
press: 1.00000 atm
elementType: 8 8 8 6 6 6 6 6 6 6 6 6 6 6 6 6 6 6 1 1 1 1 1 1 1 1 1 1 1 1 1 1 1 1 1 1
symmnumber: 1
zpe: 776785.6 jmol-1
zpe.correction: 0.295862 hartree
zpe.thermalcorrener: 0.313283 hartree
zpe.thermalcorrenthalpy: 0.314227 hartree
zpe.thermalcorrgfe: 0.248365 hartree
zpe.sumelectzpe: -806.730756 hartree
zpe.sumelectthermal: -806.713335 hartree
zpe.sumelectthermalent: -806.712391 hartree
zpe.sumelectthermalfe: -806.778253 hartree
dipole: -3.1308 -0.6220 -2.5765
dipole: 4.1020
quadrupole: -109.0472 -97.3332 -104.6380
quadrupole: -4.2604 -0.0640 -4.9249
quadrupole: -5.3744 6.3396 -0.9652 -4.2604 -0.0640 -4.9249
hfenergy: -807.0266178 hartree
pointgroup: C01 [X(C15H18O3)]
dipole: -1.1436495 -0.2676742 -1.1067815 debye
polarizability: 172.8732967|-20.1421496|170.0828708|3.5060043|6.561217|145.1917463 unknown
InChI: InChI=1S/C15H18O3/c1-18-14(17)10-12-8-5-9-13(16)15(12)11-6-3-2-4-7-11/h2-4,6-7,12,15H,5,8-10H2,1H3
charge 0 multiplicity 1
36 atoms
O  2.133962 2.280592 1.124382
O  -3.418913 -1.810199 -0.958946
O  -3.164728 -0.775921 1.111388
C  -0.855028 0.714568 0.097153
C  0.630833 0.996281 -0.362444
C  -1.744049 1.962797 -0.130244
C  -1.194352 3.214438 0.585078
C  0.26885 3.509458 0.147901
C  1.128906 2.268682 0.368476
C  -1.422147 -0.520885 -0.636768
C  1.553003 -0.202232 -0.199259
C  -2.731585 -1.008764 -0.041101
C  2.134234 -0.819163 -1.335144
C  1.838845 -0.737284 1.083764
C  2.975847 -1.947114 -1.20047
C  2.67698 -1.864308 1.222898
C  3.248174 -2.475181 0.081716
C  -4.688296 -2.402983 -0.469907
H  -0.844146 0.488449 1.182669
H  0.573663 1.263218 -1.440842
H  -2.766924 1.747566 0.229795
H  -1.814486 2.162341 -1.221075
H  -1.223029 3.060319 1.681545
H  -1.829146 4.093115 0.366181
H  0.702621 4.351099 0.71373
H  0.273777 3.769985 -0.930224
H  -0.702916 -1.361102 -0.576868
H  -1.572433 -0.318867 -1.713928
H  1.928877 -0.411984 -2.333702
H  1.421898 -0.260016 1.976903
H  3.416424 -2.409684 -2.090899
H  2.892138 -2.261733 2.221204
H  3.900724 -3.348628 0.191716
H  -4.501044 -3.027975 0.419327
H  -5.057064 -3.007432 -1.310189
H  -5.405069 -1.606956 -0.206818
