program: Gaussian 09
title: 000232910
version: EM64L-G09RevD.01
frameworkgroup: C1[X(C18H40N2)]
method: RPBEPBE
basis: SDD
operation: Freq
keyword: #pfreq=noraman
keyword: PBEPBE/SDD
title: #p freq=noraman PBEPBE/SDD
converged: YES YES NO NO
title: Mulliken charges:
elementType: N N C C C C C C C C C C C C C C C C C C H H H H H H H H H H H H H H H H H H H H H H H H H H H H H H H H H H H H H H H H
charge: -0.343679 -0.098461 -0.372433 -0.415561 -0.386826 -0.009393 -0.384638 -0.385189 -0.383510 -0.382451 -0.372530 -0.363845 -0.774018 -0.353647 -0.430983 -0.323908 -0.356454 -0.697059 -0.617978 -0.615097 0.199594 0.214599 0.191966 0.206289 0.187632 0.195988 0.184093 0.193115 0.186377 0.191993 0.192685 0.192177 0.192367 0.191739 0.191567 0.242856 0.189156 0.188998 0.183897 0.237368 0.236855 0.206436 0.216894 0.187484 0.187456 0.188413 0.197307 0.178524 0.226091 0.194648 0.194489 0.214526 0.209590 0.209591 0.184712 0.220550 0.224032 0.214230 0.185545 0.235834
chargesum: 0.00000
title: Mulliken charges with hydrogens summed into heavy atoms:
elementType: N N C C C C C C C C C C C C C C C C C C
charge: -0.100824 -0.098461 0.041761 -0.017306 -0.003207 0.174700 -0.005146 -0.000511 0.001033 0.000854 0.005623 0.057420 -0.113833 0.021294 -0.045263 0.080707 0.032683 -0.063352 0.011316 0.020512
polarizability: 2.54902250e+02 -8.24275992e+00 2.07000471e+02 -2.05047698e+00 1.06442991e+00 1.77999460e+02
1716.lowfreq: -17.6814 -0.0012 0.0008 0.0015 2.9340 5.1473 14.1031 15.5255 26.8595
frequency: -14.0403 14.2265 26.7493 29.8446 35.5817 40.8755 57.7837 60.2015 65.6121 83.6043 94.3830 103.1266 122.7683 130.1132 140.3686 144.3412 152.9243 159.5321 172.9673 188.7148 217.3298 229.6283 231.2445 233.6862 242.7926 260.6830 291.0106 310.0120 342.5777 367.9298 377.7407 390.6223 410.6315 425.8326 449.0376 476.3967 483.7097 524.2221 597.8454 661.5798 717.2428 719.8557 726.1696 739.2533 743.8635 764.7270 806.8263 817.9669 845.2940 859.1265 885.9159 887.7836 913.9021 917.8702 959.6519 967.0761 978.3245 992.5474 996.1789 1008.1958 1018.6034 1029.2919 1033.4618 1039.6188 1051.1370 1061.4175 1067.3754 1078.1278 1080.2671 1081.0265 1082.4800 1093.0903 1099.8028 1110.4916 1125.0394 1133.7355 1144.0935 1174.0684 1183.1214 1188.1170 1198.9111 1207.5073 1217.1056 1232.9800 1235.8593 1256.8145 1259.5284 1262.1900 1267.0786 1275.3634 1277.6142 1283.6378 1286.1477 1288.7860 1294.2399 1295.9094 1297.3334 1310.6191 1323.2619 1332.8192 1342.0323 1349.9477 1350.6632 1353.7180 1354.4656 1356.2976 1365.7555 1375.1994 1386.5738 1388.7560 1415.6860 1436.8821 1448.1001 1455.5817 1458.2504 1459.7655 1460.5914 1461.3278 1463.1029 1465.3669 1466.8862 1471.4162 1472.2576 1475.1024 1476.3169 1477.0878 1478.2241 1480.7282 1482.5425 1484.4354 1484.8425 1486.8427 1488.1199 1490.3146 2831.0744 2837.6179 2838.9986 2856.9804 2859.2587 2944.1806 2946.5306 2947.9277 2948.9614 2950.9187 2955.1514 2960.7818 2964.5874 2966.9581 2969.6734 2971.1946 2975.1571 2976.0881 2978.3832 2981.6769 2987.0241 2994.8550 3003.7720 3009.8536 3013.0202 3017.6035 3021.6216 3025.4400 3028.8070 3038.5238 3043.3155 3044.8864 3050.9113 3064.6132 3067.7746 3069.4750 3073.6843 3080.8270 3086.4835 3410.6752
redmass: 1.5697 3.8497 3.5748 3.5278 3.1223 3.0685 1.7487 2.9286 2.8817 3.3968 2.2872 1.9279 2.5211 1.9023 2.9579 2.2639 2.0634 2.8370 3.2249 2.1448 1.2382 1.1295 1.1245 1.1335 2.8303 2.4138 3.2129 2.2379 2.2917 3.1432 2.0575 2.6460 2.0862 2.5138 2.3075 3.0339 2.9604 2.6302 2.0558 1.6868 1.0591 1.0677 1.0858 1.1331 2.5186 1.1789 1.2489 2.4635 1.8033 1.2780 2.3189 1.9067 1.3791 1.6415 1.9842 1.3955 1.8321 2.8802 3.5355 1.6990 1.4294 2.6155 1.5123 1.5488 2.5716 2.4604 2.0825 2.1921 1.7431 2.1050 2.1744 1.5705 2.1203 2.1030 2.7786 1.4808 1.7802 2.1721 1.8006 1.8482 1.3394 1.5068 1.3648 1.3717 1.3581 1.6078 1.3478 1.3504 2.0935 1.0403 1.1416 1.0861 1.2573 1.1851 1.1111 1.1207 1.2525 1.4069 1.3617 1.3774 1.4650 1.3861 1.6783 1.6298 1.6663 1.4378 1.4226 1.3482 1.2566 1.2174 1.1411 1.1556 1.1757 1.0643 1.0736 1.0701 1.0648 1.0803 1.0738 1.0699 1.0730 1.0769 1.0790 1.0601 1.0817 1.0624 1.0800 1.0876 1.0847 1.0591 1.0694 1.0845 1.0913 1.0868 1.0816 1.0680 1.0575 1.0678 1.0645 1.0585 1.0586 1.0589 1.0590 1.0593 1.0592 1.0588 1.0591 1.0585 1.0622 1.0366 1.0597 1.0415 1.0954 1.0966 1.0984 1.1003 1.1007 1.1000 1.0723 1.1041 1.0764 1.0873 1.1048 1.1044 1.0969 1.0957 1.0898 1.0979 1.1006 1.0993 1.1002 1.0999 1.0996 1.0741
irintensity: 0.0007 0.0085 0.1516 0.0501 0.1164 0.0793 0.0307 0.8188 0.1179 0.0504 0.0298 0.0254 0.2902 0.4343 0.1182 0.2077 0.0982 0.2623 0.4616 2.7659 1.9539 0.0028 0.8134 0.7712 0.5788 1.5050 0.4428 8.4041 0.8238 1.4127 3.1526 3.3121 0.7100 2.8392 3.0447 0.1144 0.7641 3.9406 29.0548 46.4491 17.6366 0.4876 8.3592 0.8969 11.3524 2.3515 0.2376 3.2367 5.0475 0.8549 1.2341 4.7178 0.5767 4.7332 2.3545 1.3849 6.6460 4.6674 0.6894 12.0467 11.8717 2.8608 12.6827 5.2937 5.9239 3.3678 6.0705 0.9702 3.0392 0.2145 0.1450 3.0744 7.1718 16.8096 12.2380 7.1802 16.6237 32.6253 1.6974 26.9337 23.9149 3.2220 14.6809 4.8027 0.7695 6.9266 1.3767 3.6737 9.6276 0.2451 0.1138 0.5796 1.4130 0.8374 0.0333 0.0896 0.5536 0.7903 2.6095 20.4229 2.5718 1.8893 0.2490 0.1267 1.1346 5.2710 7.0771 3.1090 26.4735 11.2859 1.9768 3.4521 8.4251 8.9533 0.7134 5.7363 11.0533 6.7749 1.6602 0.5960 4.1459 2.2075 11.1587 8.4028 10.9355 14.7636 2.3657 8.4161 2.8751 7.1142 1.9616 8.1485 28.7379 31.9975 92.0489 46.3096 81.8371 305.7516 133.2260 0.3325 1.9041 0.7112 1.3355 5.4595 3.3996 81.1522 5.3022 135.4495 130.8210 38.5703 50.4873 51.9300 0.3432 0.2997 1.0823 2.6902 8.1850 10.0293 50.1940 0.8477 21.4240 37.2558 0.6353 74.0957 239.6733 54.4546 49.5647 51.8060 96.7116 55.7099 38.0708 41.4789 35.0494 4.4581
temp: 298.150 k
press: 1.00000 atm
elementType: 7 7 6 6 6 6 6 6 6 6 6 6 6 6 6 6 6 6 6 6 1 1 1 1 1 1 1 1 1 1 1 1 1 1 1 1 1 1 1 1 1 1 1 1 1 1 1 1 1 1 1 1 1 1 1 1 1 1 1 1
symmnumber: 1
zpe: 1450666.6 jmol-1
zpe.correction: 0.552530 hartree
zpe.thermalcorrener: 0.578955 hartree
zpe.thermalcorrenthalpy: 0.579900 hartree
zpe.thermalcorrgfe: 0.492555 hartree
zpe.sumelectzpe: -817.680847 hartree
zpe.sumelectthermal: -817.654422 hartree
zpe.sumelectthermalent: -817.653477 hartree
zpe.sumelectthermalfe: -817.740822 hartree
dipole: 0.9212 0.2854 -0.2930
dipole: 1.0079
quadrupole: -125.4288 -125.8872 -132.1732
quadrupole: 0.5193 -1.7547 0.3270
quadrupole: 2.4009 1.9425 -4.3435 0.5193 -1.7547 0.3270
hfenergy: -818.233377 hartree
pointgroup: C01 [X(C18H40N2)]
dipole: -0.3650638 0.1135717 0.1052486 debye
polarizability: 254.6245365|8.948882|207.0148979|-2.1582646|-3.0667912|178.2627463 unknown
InChI: InChI=1S/C18H40N2/c1-5-6-7-8-9-10-11-12-13-15-18(2)19-16-14-17-20(3)4/h18-19H,5-17H2,1-4H3
charge 0 multiplicity 1
60 atoms
N  -4.714474 -0.850793 0.521576
N  -3.035754 2.492836 -0.362396
C  -1.790641 -1.785394 0.127041
C  -2.984856 -2.103268 -0.798614
C  -0.488499 -1.498743 -0.653691
C  -4.366548 -2.163655 -0.087238
C  0.712791 -1.167609 0.260354
C  2.022255 -0.901928 -0.516056
C  3.215934 -0.54365 0.397482
C  4.532441 -0.306239 -0.376288
C  5.721712 0.067105 0.537169
C  -5.141082 0.212506 -0.417412
C  -4.411201 -3.249017 1.009238
C  7.043343 0.286881 -0.233076
C  -5.286195 1.565211 0.31021
C  -3.923032 2.127397 0.771175
C  8.229408 0.668117 0.682055
C  9.548105 0.878835 -0.093028
C  -3.447359 3.733874 -1.047161
C  -1.611892 2.532503 0.027064
H  -1.614021 -2.628098 0.826397
H  -2.060617 -0.90875 0.748178
H  -2.82101 -3.073269 -1.312645
H  -3.028845 -1.335048 -1.59696
H  -0.233877 -2.374425 -1.288086
H  -0.662948 -0.651572 -1.350252
H  -5.117975 -2.443835 -0.871598
H  0.87352 -2.003618 0.973354
H  0.466519 -0.27832 0.87883
H  2.277982 -1.79903 -1.118331
H  1.856616 -0.078707 -1.242666
H  3.368366 -1.357941 1.136965
H  2.966967 0.364926 0.985198
H  4.377928 0.499724 -1.124314
H  4.786807 -1.219657 -0.954053
H  -5.408801 -0.970128 1.274172
H  5.4717 0.987522 1.105747
H  5.867938 -0.733151 1.293064
H  -6.098183 -0.040519 -0.939942
H  -4.364188 0.333703 -1.193467
H  -3.749594 -2.980863 1.852237
H  -5.438134 -3.37152 1.404861
H  -4.08554 -4.225225 0.607689
H  7.298133 -0.635621 -0.796104
H  6.898061 1.083059 -0.993391
H  -5.939125 1.446022 1.20037
H  -5.799875 2.284197 -0.357599
H  -4.086378 2.998847 1.457572
H  -3.419804 1.332764 1.35197
H  7.975057 1.592154 1.240748
H  8.370283 -0.125582 1.444357
H  10.379306 1.14815 0.584634
H  9.444391 1.689135 -0.839415
H  9.838987 -0.040294 -0.636212
H  -3.390822 4.638494 -0.387073
H  -2.796043 3.908878 -1.922638
H  -4.484642 3.646117 -1.413395
H  -0.986857 2.727481 -0.863997
H  -1.378141 3.322209 0.78717
H  -1.314292 1.554918 0.44612
