program: Gaussian 09
title: 000232892
version: EM64L-G09RevD.01
frameworkgroup: C1[X(C14H14O5)]
method: RPBEPBE
basis: SDD
operation: Freq
keyword: #pfreq=noraman
keyword: PBEPBE/SDD
title: #p freq=noraman PBEPBE/SDD
converged: YES YES NO NO
title: Mulliken charges:
elementType: O O O O O C C C C C C C C C C C C C C H H H H H H H H H H H H H H
charge: -0.208323 -0.258363 -0.132844 -0.264211 -0.189962 -0.305229 -0.475625 -0.572770 0.423718 0.148355 0.054444 0.106240 -0.543109 -0.356178 0.332944 -0.375209 0.156398 -0.535390 -0.498588 0.301931 0.236371 0.233423 0.232353 0.260830 0.261359 0.277614 0.248167 0.249257 0.228582 0.226025 0.251902 0.247106 0.238784
chargesum: 0.00000
title: Mulliken charges with hydrogens summed into heavy atoms:
elementType: O O O O O C C C C C C C C C C C C C C
charge: -0.208323 -0.258363 -0.132844 -0.264211 -0.189962 -0.003298 -0.005831 -0.079587 0.423718 0.148355 0.054444 0.106240 -0.281750 -0.078563 0.332944 -0.127043 0.156398 0.168474 0.239204
polarizability: 2.61697938e+02 -7.33983779e+00 1.47461010e+02 1.47881740e+01 5.08997457e-01 1.14201514e+02
1716.lowfreq: -7.7699 0.0003 0.0006 0.0009 0.4013 5.4875 14.9674 19.4409 24.5741
frequency: 14.8379 19.2832 24.5062 78.4199 93.0605 100.8027 115.1052 131.5986 151.0728 154.7997 182.6658 212.7929 217.8323 262.2284 280.8160 303.4830 313.6934 330.9857 352.9645 415.1731 430.8160 445.8540 462.4738 508.3097 529.6817 546.5878 568.9726 599.8674 658.8470 667.5058 710.2401 738.0906 744.8652 776.0070 819.3225 841.1881 870.9537 885.4546 898.3098 915.4398 925.7315 981.3186 995.6999 996.3772 1018.0284 1049.6432 1086.7339 1111.3827 1111.8609 1120.7832 1140.7371 1145.9588 1148.8005 1163.9660 1176.6817 1184.0290 1232.1616 1261.9442 1271.6201 1291.4603 1309.1762 1340.0587 1352.6987 1387.0384 1418.5573 1435.2033 1445.4909 1452.1450 1453.8601 1459.8657 1468.6040 1471.9405 1474.3890 1487.7266 1560.0886 1576.9229 1614.7053 1628.6202 1638.2331 2969.4628 2979.4535 2998.6810 3008.7806 3040.7684 3058.1462 3061.9369 3066.4933 3113.1791 3132.1729 3147.5683 3150.2422 3158.6169 3170.3563
redmass: 6.9847 5.7944 5.2621 4.0679 4.6659 1.0777 6.4805 4.4621 3.9667 6.1615 3.9918 3.4268 1.1682 3.9556 2.8840 4.4789 3.1697 7.0508 8.3742 3.9699 6.6891 3.3544 7.2010 6.8125 4.7444 5.3489 3.5046 5.6751 3.2443 4.8079 5.4876 4.0089 5.9214 4.5874 2.0536 2.2255 3.7114 2.0301 1.9961 3.5832 4.7306 1.3746 4.0871 3.8859 3.4155 2.3528 2.8411 1.2693 1.2588 2.0466 2.9497 1.5523 1.4745 1.2323 1.5811 1.2615 2.0961 1.7100 1.8717 1.9337 1.6054 1.5307 1.4439 8.2659 1.1681 1.2911 3.1258 1.0496 1.1261 1.0506 1.0514 1.0871 1.1056 2.5580 9.0532 7.9887 9.1854 7.7141 10.7690 1.0325 1.0636 1.0611 1.0293 1.0960 1.1030 1.1044 1.0845 1.1048 1.1002 1.0884 1.0916 1.1052 1.0957
irintensity: 0.8290 2.0291 2.2672 0.3972 4.1252 0.2138 3.3217 3.8807 2.4046 1.2214 7.6128 2.9753 0.0116 11.2583 2.3249 1.6530 2.0197 3.4585 1.1506 0.8394 1.0405 5.2455 10.3890 15.5167 0.6965 46.5142 1.7718 10.0833 2.9518 8.6982 4.8442 3.4970 13.6981 0.8592 36.5716 6.7142 7.4560 9.3913 31.2335 41.0035 2.2810 2.7529 158.0250 4.0757 52.8127 64.4482 6.4527 0.1474 0.2079 207.0798 86.1141 18.6447 15.5331 26.7739 2.8173 42.1787 45.8089 93.5694 244.9115 133.2495 39.4119 20.9349 20.6210 17.5517 7.7524 6.5546 3.5019 14.1212 16.6698 10.4754 16.0499 44.8825 13.0320 23.0511 59.2052 341.8130 144.0866 189.0478 87.2399 70.1194 10.4654 27.1458 26.0463 24.2349 26.5716 41.0551 1.3763 18.5205 22.0668 0.6105 3.7839 11.7399 14.5034
temp: 298.150 k
press: 1.00000 atm
elementType: 8 8 8 8 8 6 6 6 6 6 6 6 6 6 6 6 6 6 6 1 1 1 1 1 1 1 1 1 1 1 1 1 1
symmnumber: 1
zpe: 662856.8 jmol-1
zpe.correction: 0.252469 hartree
zpe.thermalcorrener: 0.270718 hartree
zpe.thermalcorrenthalpy: 0.271662 hartree
zpe.thermalcorrgfe: 0.203393 hartree
zpe.sumelectzpe: -916.596765 hartree
zpe.sumelectthermal: -916.578516 hartree
zpe.sumelectthermalent: -916.577571 hartree
zpe.sumelectthermalfe: -916.645841 hartree
dipole: 1.7719 -1.9222 -3.9395
dipole: 4.7280
quadrupole: -68.0209 -114.7118 -118.6865
quadrupole: 7.3129 17.5100 5.1685
quadrupole: 32.4522 -14.2388 -18.2134 7.3129 17.5100 5.1685
hfenergy: -916.8492338 hartree
pointgroup: C01 [X(C14H14O5)]
dipole: 0.7016511 0.7705598 1.5407887 debye
polarizability: 261.7405885|6.6531452|147.4054635|-14.9690911|0.1959737|114.2144091 unknown
InChI: InChI=1S/C14H14O5/c1-18-9-4-6-10-8(7-9)3-5-11(12(10)15)13(16)14(17)19-2/h4,6-7,11H,3,5H2,1-2H3
charge 0 multiplicity 1
33 atoms
O  -0.498878 -2.520067 0.374118
O  4.884543 1.032984 -0.171798
O  -1.560346 0.185007 -1.784029
O  -4.2601 0.065202 0.565305
O  -4.382052 0.617971 -1.697894
C  -1.508653 -0.326666 0.620911
C  -1.076849 0.993114 1.341355
C  0.077606 1.689737 0.593814
C  1.250495 0.751426 0.354982
C  1.042602 -0.662073 0.258855
C  -0.30227 -1.26773 0.405069
C  -2.178686 0.029878 -0.705623
C  2.551969 1.262828 0.209632
C  2.151007 -1.514775 0.010112
C  3.647269 0.399677 -0.043501
C  3.448769 -1.004905 -0.146043
C  -3.716553 0.273485 -0.702437
C  6.062061 0.1993 -0.445132
C  -5.730353 0.260264 0.67163
H  -2.243351 -0.859382 1.246845
H  -0.754648 0.723662 2.365069
H  -1.945837 1.669742 1.440379
H  0.413292 2.576158 1.162958
H  -0.282559 2.063671 -0.385675
H  2.74669 2.337737 0.284927
H  1.959895 -2.590697 -0.06212
H  4.2833 -1.683581 -0.343297
H  6.901456 0.906369 -0.509048
H  5.953693 -0.342076 -1.403989
H  6.240703 -0.521728 0.375056
H  -6.250163 -0.438257 -0.004747
H  -5.993364 1.295944 0.398986
H  -5.966389 0.049279 1.723231
