program: Gaussian 09
title: 000232930
version: EM64L-G09RevD.01
frameworkgroup: C1[X(C21H27NO3)]
method: RPBEPBE
basis: SDD
operation: Freq
keyword: #p
keyword: freq=noraman
keyword: PBEPBE/SDD
title: #p freq=noraman PBEPBE/SDD
converged: YES YES NO NO
title: Mulliken charges:
elementType: O O O N C C C C C C C C C C C C C C C C C C C C C H H H H H H H H H H H H H H H H H H H H H H H H H H H
charge: -0.419065 -0.243891 -0.230942 -0.073954 -0.217399 0.421908 -0.532358 0.057546 -0.722172 -0.672830 0.050931 0.388418 -0.557302 -0.812095 0.503823 -0.410405 0.221186 -0.529873 0.199890 -0.428481 -0.349437 -0.240167 -0.244673 -0.685587 -0.683076 0.179688 0.243926 0.210487 0.219301 0.228933 0.223445 0.212708 0.226960 0.254854 0.234536 0.243358 0.215256 0.217035 0.350474 0.292867 0.225809 0.247129 0.211423 0.210844 0.209024 0.208680 0.205307 0.232054 0.232118 0.204650 0.234503 0.234635
chargesum: 0.00000
title: Mulliken charges with hydrogens summed into heavy atoms:
elementType: O O O N C C C C C C C C C C C C C C C C C C C C C
charge: -0.068591 -0.243891 -0.230942 -0.073954 -0.037711 0.421908 -0.288432 0.057546 -0.063451 -0.009717 0.050931 0.388418 -0.302448 -0.118946 0.503823 -0.193370 0.221186 -0.237006 0.199890 -0.202672 -0.102308 0.182100 0.173031 -0.016107 -0.009287
polarizability: 4.98811262e+02 2.55978013e+01 2.69005276e+02 -1.20212364e-01 2.15671090e-01 1.53046620e+02
1716.lowfreq: -4.1791 -0.0011 -0.0007 -0.0005 2.4174 3.2010 14.9677 24.0914 32.1094
frequency: 14.4187 24.0432 32.1083 47.8920 62.5242 66.9604 78.5521 86.6985 96.3752 101.4922 104.9069 116.0796 125.1804 154.8480 178.5191 185.3212 205.4063 214.7971 236.8493 238.8090 240.4227 244.9249 248.5202 268.3365 281.5968 296.1531 313.7699 324.4678 335.2179 341.8001 365.1254 391.3559 412.3413 422.7212 438.7017 465.9511 469.0318 489.8826 509.8646 541.3435 577.6742 584.9478 612.2504 621.9081 665.9365 681.3409 724.3277 739.6673 741.6499 748.3005 755.1149 796.6011 821.9321 831.7606 833.2710 870.5948 878.4335 884.1521 886.0825 899.6777 901.1982 916.8213 917.9705 960.8555 974.1433 992.6924 1000.4734 1031.8310 1033.3046 1034.0231 1047.3653 1090.8695 1113.4145 1115.8604 1116.8317 1126.5849 1130.4506 1134.3716 1135.1775 1155.6360 1165.6340 1183.0227 1211.4342 1217.6778 1258.7545 1261.4361 1262.2973 1262.3891 1271.9543 1284.7591 1287.2032 1332.3423 1352.0356 1365.6488 1370.8738 1380.1303 1389.8454 1395.1960 1396.3916 1397.9255 1399.5055 1407.6613 1413.2870 1431.2399 1452.0329 1459.5528 1460.3306 1465.5733 1470.8291 1474.5664 1476.0993 1476.3064 1483.0688 1486.2741 1487.6760 1491.9924 1498.4281 1506.1102 1558.1545 1575.6452 1598.4236 1607.2308 1627.5740 2891.2017 2939.4591 2954.1783 2956.0566 2975.6775 2980.3644 2981.9796 2996.4199 2998.1638 3013.5086 3014.6517 3061.4056 3070.8225 3072.9333 3079.9332 3083.5523 3091.0462 3093.8018 3095.3200 3106.1069 3108.4957 3126.8594 3140.9932 3152.9114 3166.2095 3168.6881 3574.6856
redmass: 3.8473 4.2882 4.5271 3.3342 3.3207 3.4255 3.2610 3.0907 1.1095 2.2845 3.2294 2.1326 2.5130 4.1349 5.1060 2.7629 2.8083 2.6791 1.6832 1.6351 2.5313 1.2539 2.1311 1.2236 2.3348 3.3090 4.6110 1.4465 2.4371 3.4977 3.5969 3.8501 3.5483 4.8674 4.3534 3.1596 3.1711 5.1511 3.4079 5.2883 3.8142 5.1557 5.5700 3.8029 5.5505 4.5274 5.7352 4.2967 3.1007 3.1845 4.1262 1.4332 1.1082 1.6511 1.8287 2.0038 1.7090 2.6472 1.6961 1.8043 2.2996 1.3449 1.1935 1.4354 1.6364 2.9976 1.4974 2.7142 2.6539 2.6734 1.5728 1.8798 2.2764 2.3127 2.4166 2.0845 1.8248 1.4356 1.4477 1.8982 1.8631 2.2041 2.2766 2.0619 3.0213 1.1559 1.3988 1.3028 1.3925 1.3705 2.5436 1.6898 1.7800 1.3096 1.6259 1.2029 2.6961 1.3492 1.3687 1.2830 1.3265 2.5630 2.8996 5.6976 1.0667 1.0403 1.0397 1.0492 1.0672 1.1748 1.0811 1.1339 1.1298 1.1573 1.0826 1.0687 2.3647 2.4270 6.6600 7.3725 6.2081 6.6228 6.7274 1.0819 1.0852 1.0552 1.0553 1.0351 1.0356 1.0368 1.0361 1.0363 1.1075 1.1074 1.0957 1.1002 1.0996 1.0996 1.1001 1.1005 1.0989 1.0988 1.1014 1.1014 1.0892 1.0893 1.0919 1.0919 1.0922 1.0652
irintensity: 0.2744 0.2409 0.3901 0.1160 3.8521 0.9884 0.3479 1.7923 0.2742 5.0078 2.0208 0.4227 0.0768 0.1482 3.0576 0.6043 4.1658 3.2003 5.3037 0.0088 0.8696 0.1128 1.2694 1.0607 9.3983 4.0308 1.4989 90.3093 22.2238 1.7333 1.4427 6.1368 1.5022 0.7982 15.6960 2.0836 7.0114 31.6192 1.0416 14.2334 3.5377 6.0257 8.6029 15.3397 3.5593 2.2060 12.6206 3.6624 0.2174 2.6831 10.5086 41.0500 8.4058 21.8621 22.4939 6.8748 3.9501 31.5017 26.3706 26.8225 39.9421 2.8244 4.5124 2.3808 18.0153 12.3751 34.4061 94.1433 28.0779 29.6435 14.0079 6.7015 5.1576 5.2108 24.6747 49.0748 307.7657 5.7999 5.1433 94.9951 6.8238 64.8767 108.4326 108.8562 464.2822 7.9874 11.0675 6.5042 24.3509 25.1735 59.3287 64.5851 45.4754 14.8693 4.1940 15.5772 10.7940 11.2035 48.2825 4.4421 30.9982 14.0547 12.9776 83.3696 21.4628 6.9160 16.5237 9.2111 50.1861 82.0492 57.6399 0.8920 15.2321 59.4668 1.1871 6.9589 12.3425 236.8943 19.3381 66.4979 113.8108 24.7717 61.0966 46.8283 62.8757 57.7749 20.7458 40.5937 25.5821 25.5645 26.1158 34.6626 28.1294 38.9494 17.8027 8.0365 51.2651 58.1831 39.3750 27.4856 29.0020 25.8870 31.5624 34.3023 12.5595 8.7046 10.8405 16.8857 15.8840 57.1382
temp: 298.150 k
press: 1.00000 atm
elementType: 8 8 8 7 6 6 6 6 6 6 6 6 6 6 6 6 6 6 6 6 6 6 6 6 6 1 1 1 1 1 1 1 1 1 1 1 1 1 1 1 1 1 1 1 1 1 1 1 1 1 1 1
symmnumber: 1
zpe: 1131121.5 jmol-1
zpe.correction: 0.430821 hartree
zpe.thermalcorrener: 0.457786 hartree
zpe.thermalcorrenthalpy: 0.458730 hartree
zpe.thermalcorrgfe: 0.372069 hartree
zpe.sumelectzpe: -1094.964599 hartree
zpe.sumelectthermal: -1094.937635 hartree
zpe.sumelectthermalent: -1094.936691 hartree
zpe.sumelectthermalfe: -1095.023352 hartree
dipole: -0.9495 -3.2020 0.3112
dipole: 3.3542
quadrupole: -132.8602 -131.1155 -152.5082
quadrupole: -5.7094 5.3588 2.8469
quadrupole: 5.9678 7.7125 -13.6802 -5.7094 5.3588 2.8469
hfenergy: -1095.3954206 hartree
pointgroup: C01 [X(C21H27N1O3)]
dipole: -0.3817062 -1.2605446 0.0826193 debye
polarizability: 498.285458|24.7063978|268.790877|15.471432|3.4304127|153.7868222 unknown
InChI: InChI=1S/C21H27NO3/c1-6-24-20-9-8-16(11-21(20)25-7-2)13-22-18-12-17(14(3)4)19(23)10-15(18)5/h8-14,23H,6-7H2,1-5H3
charge 0 multiplicity 1
52 atoms
O  6.473628 1.032574 -0.120202
O  -4.295008 1.556234 0.381806
O  -5.519907 -0.694421 -0.273176
N  0.841458 0.616203 -0.27493
C  5.324465 -1.561157 0.724657
C  4.463781 -0.398233 0.214874
C  3.055867 -0.458477 0.146348
C  5.075952 0.835583 -0.152327
C  4.643407 -2.94344 0.610593
C  5.777551 -1.300942 2.192564
C  2.259639 0.651524 -0.255666
C  2.898738 1.890385 -0.587797
C  4.305365 1.952821 -0.539748
C  2.075926 3.090864 -1.007601
C  -1.289488 -0.549153 -0.493791
C  0.174369 -0.477098 -0.565347
C  -3.459263 0.507326 -0.011643
C  -2.058505 0.576571 -0.07591
C  -4.128682 -0.715873 -0.368617
C  -1.956209 -1.747743 -0.843657
C  -3.364069 -1.831165 -0.780915
C  -3.647883 2.83153 0.753932
C  -6.25234 -1.927546 -0.629682
C  -4.767966 3.79576 1.133545
C  -7.735328 -1.623673 -0.437493
H  6.241641 -1.620642 0.091247
H  2.548524 -1.380171 0.451055
H  3.773143 -3.018913 1.288545
H  5.352779 -3.740894 0.897405
H  4.296893 -3.141884 -0.419427
H  6.287821 -0.326423 2.303136
H  6.464567 -2.095024 2.540283
H  4.897545 -1.289621 2.860855
H  4.830462 2.877061 -0.801285
H  1.602506 2.927487 -1.993922
H  1.250728 3.260609 -0.293507
H  2.698876 3.999575 -1.070258
H  0.682337 -1.405436 -0.905938
H  6.941086 0.184517 0.082619
H  -1.509489 1.484445 0.187964
H  -1.374129 -2.618907 -1.167436
H  -3.859835 -2.766534 -1.054981
H  -2.955654 2.658786 1.603525
H  -3.059838 3.210369 -0.107198
H  -6.02712 -2.197998 -1.681944
H  -5.919727 -2.756235 0.028993
H  -4.343381 4.773825 1.42484
H  -5.453954 3.949106 0.283233
H  -5.351424 3.398904 1.981604
H  -8.341217 -2.513255 -0.689069
H  -7.941028 -1.34192 0.608971
H  -8.047807 -0.789283 -1.087828
