program: Gaussian 09
title: 000232878
version: EM64L-G09RevD.01
frameworkgroup: C1[X(C24H26O4)]
method: RPBEPBE
basis: SDD
operation: Freq
keyword: #pfreq=noraman
keyword: PBEPBE/SDD
title: #p freq=noraman PBEPBE/SDD
converged: YES YES NO NO
title: Mulliken charges:
elementType: O O O O C C C C C C C C C C C C C C C C C C C C C C C C H H H H H H H H H H H H H H H H H H H H H H H H H H
charge: -0.450062 -0.450062 -0.268261 -0.268262 0.030444 0.030445 -0.492047 -0.492046 -0.439997 -0.439998 0.273310 0.273307 -0.544444 -0.544443 0.288946 0.288945 -0.031281 -0.031280 -0.357898 -0.357899 -0.528538 -0.528536 0.319647 0.319646 -0.385990 -0.385990 -0.536443 -0.536443 0.210151 0.232869 0.232869 0.210151 0.234647 0.209232 0.209232 0.234647 0.226950 0.225395 0.225396 0.226950 0.264205 0.264206 0.256046 0.256045 0.339121 0.339121 0.239791 0.239792 0.243407 0.221389 0.219411 0.219411 0.221389 0.243407
chargesum: 0.00000
title: Mulliken charges with hydrogens summed into heavy atoms:
elementType: O O O O C C C C C C C C C C C C C C C C C C C C C C C C
charge: -0.110941 -0.110941 -0.268261 -0.268262 0.030444 0.030445 -0.049027 -0.049026 0.003882 0.003881 0.273310 0.273307 -0.092099 -0.092097 0.288946 0.288945 -0.031281 -0.031280 -0.093694 -0.093693 -0.272493 -0.272491 0.319647 0.319646 -0.146199 -0.146198 0.147764 0.147764
polarizability: 3.76552454e+02 -3.50176393e+01 2.65085053e+02 2.42204621e+01 2.01899844e+01 1.97216176e+02
1716.lowfreq: -4.1615 0.0004 0.0007 0.0010 4.0792 14.7357 18.4291 18.7160 27.0122
frequency: 14.7357 18.7160 27.0122 34.7432 44.5047 71.1661 82.7023 90.3861 109.5951 116.1745 133.5733 174.9075 180.2476 202.3272 202.9724 213.0867 217.9266 236.8990 264.5190 265.2742 277.1327 287.7632 292.3671 303.1440 315.0968 317.1998 319.8518 348.4563 363.4261 374.7330 388.8627 407.3407 426.1256 445.9209 464.5298 470.2275 488.2537 503.5993 516.3082 539.9218 541.7257 561.0756 565.5122 581.9062 582.7471 608.2551 625.8722 631.0142 666.1646 707.2955 709.3080 731.2079 739.8077 787.6710 812.5496 813.8483 849.9191 853.4930 856.7502 872.0930 872.4124 887.2321 894.6808 909.0498 916.2751 926.6027 948.5192 952.4878 963.1829 965.0550 999.0496 1006.6518 1011.8628 1030.1172 1037.2431 1087.2643 1089.6994 1108.7437 1111.5055 1111.5151 1115.3811 1115.4519 1129.3485 1145.1873 1145.3805 1167.5063 1170.8923 1173.0354 1179.7836 1181.7638 1185.3348 1190.7753 1207.8057 1237.0726 1238.1839 1249.8523 1251.5323 1271.0504 1273.0912 1311.8693 1312.3582 1326.8907 1327.0360 1350.5848 1350.7879 1351.8970 1354.1177 1382.0530 1382.2242 1424.8549 1424.8830 1437.1041 1437.1271 1453.2407 1453.2651 1466.3542 1466.3559 1467.7298 1467.7442 1473.6742 1473.9684 1474.7560 1474.8466 1495.1922 1495.2279 1580.7065 1580.7509 1625.1282 1625.2210 2244.1483 2958.4564 2958.5093 2961.4634 2961.5264 2989.8611 2989.9161 2993.1538 2993.1714 3026.7896 3026.8231 3045.6250 3045.6378 3049.3350 3049.4175 3058.6380 3058.8358 3123.0695 3123.0924 3142.2722 3142.2941 3149.4189 3149.4572 3170.1330 3170.1419 3534.1580 3534.7738
redmass: 5.3369 5.0393 3.8518 5.7221 3.8209 3.3851 3.6266 4.5230 3.3146 3.6701 3.1846 3.9441 3.7408 4.2031 3.2976 2.3246 1.4690 1.3687 2.3495 2.3705 4.3856 2.1070 4.6829 1.2357 3.7648 1.2836 3.3667 4.8529 4.0213 3.2665 4.1129 4.6488 2.9582 3.0156 3.7237 3.6106 4.2275 4.5833 4.8142 4.6770 4.2227 5.9190 4.8193 4.8633 2.7394 3.6349 2.9399 3.2449 4.5761 5.0506 5.0098 3.6030 3.7795 2.4344 1.4516 1.5640 1.9452 1.7579 2.5161 3.0216 2.7334 1.8168 1.5456 2.2867 2.6879 2.3214 1.4101 1.4232 3.4961 4.0243 3.1353 4.3661 3.1195 2.7169 2.2181 2.0011 2.0788 2.4800 1.2599 1.2615 1.8837 1.9434 1.6497 1.4522 1.4528 1.2538 1.4552 1.6549 1.6591 1.5988 1.4269 1.4087 2.1561 1.8704 1.7516 1.9441 2.3112 1.3597 1.3558 1.6000 1.6128 1.4236 1.4465 1.5820 1.5269 1.5231 1.6439 8.6253 8.6162 3.1550 3.1542 1.2711 1.2710 1.1196 1.1197 1.0504 1.0504 1.0869 1.0875 1.0840 1.0834 1.0772 1.0767 2.6189 2.6169 7.4378 7.4176 6.9986 6.9959 11.9809 1.0329 1.0330 1.0647 1.0646 1.0599 1.0599 1.0627 1.0627 1.0944 1.0944 1.1039 1.1039 1.1012 1.1012 1.1044 1.1043 1.0994 1.0994 1.0913 1.0913 1.0872 1.0872 1.0960 1.0960 1.0658 1.0658
irintensity: 0.0018 0.0257 0.1671 0.0000 0.0000 11.0567 0.0000 0.6187 4.9860 0.0000 0.0000 11.4750 0.0000 0.0000 0.9861 0.0000 4.7545 0.0000 5.2417 17.9758 0.0000 0.0000 5.5437 202.0400 16.0745 0.0000 0.0000 0.0000 56.0610 11.3151 0.0000 0.0000 4.1209 0.0000 8.1291 0.0000 38.3475 9.7683 0.0000 41.7067 0.0000 22.4176 0.0000 0.0000 21.9986 0.0000 4.9521 0.0000 1.5852 0.0000 7.9637 0.0000 3.4814 0.0000 94.7451 0.0002 29.9215 0.0000 47.9203 0.0000 21.1818 0.0000 43.2900 0.0000 14.3823 0.0000 7.7095 0.0000 0.0000 100.7036 67.5871 0.0000 63.5066 0.0000 4.0142 0.0000 6.5225 0.0000 0.3664 0.0031 109.6343 0.0108 22.9716 0.0001 23.4357 0.0000 88.7337 0.0000 20.4562 0.0000 59.3408 0.0000 93.6999 0.0000 62.8336 0.0000 252.7997 0.0000 42.9506 0.0000 113.5815 0.0000 3.3270 0.0001 22.9052 0.0000 92.5718 0.0000 12.5522 0.0014 35.8121 0.0018 2.4963 11.8784 0.0005 22.1207 1.5665 0.0033 26.0328 18.6379 0.0002 93.0393 0.0019 150.0005 0.0249 0.0004 81.9639 209.7540 0.0004 0.0000 147.5412 0.2283 57.4911 0.0024 0.0077 42.4000 55.0739 0.0071 62.2638 0.0034 3.2735 93.6430 0.0067 89.3211 104.6501 0.0002 58.1234 0.5805 15.4711 0.5076 12.2324 0.1626 9.1445 12.5527 19.3890 0.0001
temp: 298.150 k
press: 1.00000 atm
elementType: 8 8 8 8 6 6 6 6 6 6 6 6 6 6 6 6 6 6 6 6 6 6 6 6 6 6 6 6 1 1 1 1 1 1 1 1 1 1 1 1 1 1 1 1 1 1 1 1 1 1 1 1 1 1
symmnumber: 1
zpe: 1154429.8 jmol-1
zpe.correction: 0.439699 hartree
zpe.thermalcorrener: 0.466375 hartree
zpe.thermalcorrenthalpy: 0.467319 hartree
zpe.thermalcorrgfe: 0.381616 hartree
zpe.sumelectzpe: -1228.919634 hartree
zpe.sumelectthermal: -1228.892958 hartree
zpe.sumelectthermalent: -1228.892013 hartree
zpe.sumelectthermalfe: -1228.977716 hartree
dipole: 0.0000 0.0000 -0.0001
dipole: 0.0001
quadrupole: -152.9979 -140.7437 -171.2343
quadrupole: -21.0407 3.8894 4.8704
quadrupole: 1.9940 14.2483 -16.2423 -21.0407 3.8894 4.8704
hfenergy: -1229.3593326 hartree
pointgroup: C01 [X(C24H26O4)]
dipole: -0.0000183 -0.0000115 0.0000185 debye
polarizability: 344.6216675|-16.4531211|227.5205548|72.7531143|36.0895914|266.7114609 unknown
InChI: InChI=1S/C24H26O4/c1-27-19-7-9-21-17(15-19)5-3-11-23(21,25)13-14-24(26)12-4-6-18-16-20(28-2)8-10-22(18)24/h7-10,15-16,25-26H,3-6,11-12H2,1-2H3
charge 0 multiplicity 1
54 atoms
O  -1.793997 -1.890247 1.257593
O  1.778436 1.893542 -1.471513
O  -6.220774 0.276183 -2.773127
O  6.205229 -0.272906 2.559182
C  -1.811625 -0.443682 0.879757
C  1.796061 0.446977 -1.093677
C  -1.962423 0.425825 2.155639
C  1.946854 -0.42253 -2.36956
C  -2.318184 1.882012 1.791205
C  2.302597 -1.878721 -2.005123
C  -3.009004 -0.26594 -0.065412
C  2.993444 0.269231 -0.148512
C  -3.699855 1.929873 1.103826
C  3.684263 -1.926601 -1.317738
C  -3.864576 0.869741 0.017071
C  3.849001 -0.866461 -0.230992
C  -0.543296 -0.12209 0.17535
C  0.527732 0.125389 -0.389267
C  -3.236558 -1.235306 -1.067651
C  3.221016 1.238603 0.853717
C  -4.918804 0.999859 -0.91352
C  4.903233 -0.996585 0.699593
C  -5.139078 0.023776 -1.91146
C  5.123526 -0.020496 1.697524
C  -4.293905 -1.11174 -1.991132
C  4.278368 1.115032 1.777191
C  -6.492759 -0.710358 -3.820251
C  6.477195 0.713611 3.606334
H  -1.024429 0.383256 2.740716
H  -2.769625 -0.023095 2.766166
H  2.754063 0.026383 -2.980083
H  1.008863 -0.379951 -2.95464
H  -1.538906 2.292764 1.120383
H  -2.327079 2.509653 2.701561
H  2.311487 -2.506364 -2.915478
H  1.523309 -2.289462 -1.334305
H  -3.886671 2.933272 0.676536
H  -4.485938 1.768648 1.871063
H  4.470355 -1.765401 -2.084971
H  3.871056 -2.929999 -0.890436
H  -2.581867 -2.111258 -1.1036
H  2.566337 2.114563 0.889661
H  -5.591583 1.863868 -0.876258
H  5.576002 -1.860603 0.662334
H  -0.944342 -2.062392 1.742134
H  0.928777 2.065691 -1.956045
H  -4.447396 -1.88673 -2.747574
H  4.431876 1.890027 2.533623
H  -7.366741 -0.320082 -4.362321
H  -6.733522 -1.701516 -3.388638
H  -5.636098 -0.808484 -4.515506
H  5.620515 0.811734 4.301565
H  6.717984 1.704774 3.174748
H  7.351156 0.323313 4.148421
