program: Gaussian 09
title: 000018360
version: EM64L-G09RevD.01
frameworkgroup: C1[X(C13H18O2)]
method: RPBEPBE
basis: SDD
operation: Freq
keyword: #pfreq=noraman
keyword: PBEPBE/SDD
title: #p freq=noraman PBEPBE/SDD
converged: YES YES NO NO
title: Mulliken charges:
elementType: O O C C C C C C C C C C C C C H H H H H H H H H H H H H H H H H H
charge: -0.298618 -0.269821 -0.054570 0.137475 -0.350508 -0.307457 0.496930 -0.698879 -0.698534 -0.747802 -0.404343 -0.393350 0.343820 -0.387149 -0.403048 0.249713 0.222439 0.227461 0.222887 0.214494 0.206758 0.213859 0.222912 0.214465 0.206774 0.222614 0.215977 0.216551 0.215729 0.224773 0.248070 0.245006 0.245372
chargesum: 0.00000
title: Mulliken charges with hydrogens summed into heavy atoms:
elementType: O O C C C C C C C C C C C C C
charge: -0.298618 -0.269821 0.195144 0.137475 0.099391 0.129924 0.496930 -0.055349 -0.054681 -0.099545 -0.179570 -0.145281 0.343820 -0.142143 -0.157676
polarizability: 2.09267455e+02 -1.48636297e+00 1.33225152e+02 -1.46574954e+00 6.87283987e-01 1.00650908e+02
1716.lowfreq: -20.3747 -5.4940 -3.1328 -0.0007 -0.0002 0.0003 27.5446 39.1260 59.1668
frequency: 26.1398 37.7669 59.0427 82.1757 88.6982 123.0216 186.3741 193.7873 218.4603 241.6066 254.7281 275.1531 306.8106 329.6719 351.3967 355.9293 408.9008 417.4184 432.6036 443.8632 483.9472 523.0791 548.8825 633.8584 655.5477 737.2949 745.1352 794.1940 805.9288 815.8269 837.3719 837.9422 898.3169 917.9316 931.3388 937.2192 946.2631 964.0582 967.6112 986.0139 1001.8814 1018.8320 1024.9879 1028.7945 1097.9915 1111.4520 1113.2930 1124.7673 1139.7606 1183.3738 1204.1254 1210.7024 1214.2741 1227.1134 1238.4421 1272.4356 1308.5476 1347.0906 1365.4357 1373.9596 1378.0359 1405.1018 1414.0656 1415.5418 1458.9777 1463.9849 1466.6495 1472.7444 1478.1071 1484.6009 1487.7239 1494.9632 1503.7530 1581.8557 1621.5113 2962.6823 2971.5125 2971.7540 2977.4061 3024.7129 3065.6923 3067.0126 3069.4437 3071.2359 3075.4727 3077.7132 3080.3964 3115.9348 3124.9854 3147.6944 3158.9284 3170.0418 3180.9837
redmass: 4.6614 2.9460 3.8344 4.5677 3.3256 3.7029 3.4841 1.1959 3.5063 2.6336 1.1167 3.3759 1.0488 2.8005 2.6190 3.2547 2.5044 2.7534 3.5579 3.1054 3.6751 3.2898 2.3217 6.9483 5.2481 3.6188 7.3790 4.8614 4.3583 1.3499 1.5479 2.8798 1.1920 1.7557 1.6618 1.2814 1.2749 1.4035 2.2074 3.2158 2.8750 1.4106 1.3882 1.4311 1.3654 2.1294 1.3326 1.4631 1.5348 1.3952 2.9484 1.3063 2.5764 2.4382 1.4555 3.0679 1.3037 1.5283 3.7875 1.1874 1.2415 1.2165 3.0488 2.0901 1.0508 1.0483 1.0740 1.1854 1.0822 1.1771 1.0503 1.1420 1.8829 7.0097 6.3981 1.0555 1.0347 1.0350 1.0360 1.1069 1.0999 1.0998 1.1006 1.0532 1.0984 1.0994 1.0991 1.0919 1.0877 1.0872 1.0939 1.0957 1.1192
irintensity: 0.0707 0.7369 2.3003 2.8477 0.7832 4.3615 4.2679 0.9213 1.1236 0.7706 0.2281 7.5910 0.0456 4.5832 1.1185 0.5778 0.6188 0.4936 0.1411 5.0131 3.0974 2.1317 23.5701 0.3590 5.0346 1.9548 5.2885 20.9557 33.5792 17.9150 51.6994 1.6586 6.2417 2.8590 2.5663 0.2517 0.1097 1.0867 20.2921 84.7480 14.6858 2.8706 0.1202 0.5478 4.7235 10.8970 12.5313 11.4465 1.3602 144.1166 7.7139 5.0168 1.3268 158.0797 8.9233 53.4853 0.2787 9.0539 14.9559 19.0959 27.9426 12.8371 1.3828 3.8101 0.0331 0.8302 6.6415 24.5158 17.5415 13.6837 11.5038 0.2266 152.2804 3.8659 46.4649 32.5825 34.3961 34.0638 31.5279 29.9357 5.1373 6.5556 14.0443 24.5690 131.2078 37.3346 47.8868 16.0672 22.1771 7.5090 19.5404 7.5209 30.7716
temp: 298.150 k
press: 1.00000 atm
elementType: 8 8 6 6 6 6 6 6 6 6 6 6 6 6 6 1 1 1 1 1 1 1 1 1 1 1 1 1 1 1 1 1 1
symmnumber: 1
zpe: 728823.6 jmol-1
zpe.correction: 0.277594 hartree
zpe.thermalcorrener: 0.293296 hartree
zpe.thermalcorrenthalpy: 0.294240 hartree
zpe.thermalcorrgfe: 0.233777 hartree
zpe.sumelectzpe: -655.420054 hartree
zpe.sumelectthermal: -655.404353 hartree
zpe.sumelectthermalent: -655.403409 hartree
zpe.sumelectthermalfe: -655.463872 hartree
dipole: 1.4523 0.5146 0.5507
dipole: 1.6362
quadrupole: -93.6763 -88.4608 -91.5584
quadrupole: -8.0568 -3.0910 -0.0520
quadrupole: -2.4445 2.7711 -0.3266 -8.0568 -3.0910 -0.0520
hfenergy: -655.6976485 hartree
pointgroup: C01 [X(C13H18O2)]
dipole: -0.5719627 0.2318284 -0.1831041 debye
polarizability: 209.256614|1.545453|132.7747217|-1.841347|3.83316|101.1121795 unknown
InChI: InChI=1S/C13H18O2/c1-13(2,3)10-4-6-11(7-5-10)14-8-12-9-15-12/h4-7,12H,8-9H2,1-3H3
charge 0 multiplicity 1
33 atoms
O  5.509907 -0.895508 0.004888
O  2.10677 0.645961 0.385766
C  4.418473 0.048312 0.452662
C  -3.645786 -0.139802 0.015327
C  5.26143 0.405739 -0.729493
C  3.020427 -0.501371 0.276094
C  -2.11588 0.068229 0.118613
C  -4.111962 -1.141045 1.115258
C  -3.996198 -0.720509 -1.388291
C  -4.432818 1.1830 0.201334
C  -1.236708 -1.037995 -0.014864
C  -1.521803 1.339623 0.341796
C  0.725493 0.380531 0.289646
C  0.166109 -0.901353 0.066883
C  -0.124548 1.500867 0.428093
H  4.616227 0.544738 1.410743
H  4.843252 0.290683 -1.737203
H  6.054668 1.154125 -0.619581
H  2.794193 -1.246444 1.066225
H  2.923379 -0.990765 -0.714104
H  -5.203111 -1.309853 1.041889
H  -3.610631 -2.120336 1.015137
H  -3.888359 -0.748107 2.123974
H  -3.491028 -1.686583 -1.568225
H  -5.086867 -0.887141 -1.473283
H  -3.68789 -0.023958 -2.189388
H  -5.517016 0.983484 0.119414
H  -4.24976 1.632668 1.194922
H  -4.170581 1.927953 -0.572693
H  -1.646312 -2.040247 -0.18803
H  -2.151924 2.227037 0.452024
H  0.798911 -1.78711 -0.045429
H  0.324046 2.484275 0.600995
