program: Gaussian 09
title: 000232858
version: EM64L-G09RevD.01
frameworkgroup: C1[X(C18H20O2)]
method: RPBEPBE
basis: SDD
operation: Freq
keyword: #pfreq=noraman
keyword: PBEPBE/SDD
title: #p freq=noraman PBEPBE/SDD
converged: YES YES NO YES
title: Mulliken charges:
elementType: O O C C C C C C C C C C C C C C C C C C H H H H H H H H H H H H H H H H H H H H
charge: -0.283873 -0.283873 0.004578 0.004577 0.228030 0.227905 0.228078 0.227856 -0.739550 -0.739548 -0.385067 -0.385023 -0.385060 -0.385029 -0.259590 -0.259599 -0.259569 -0.259620 -0.536200 -0.536200 0.219461 0.242133 0.242127 0.242130 0.219460 0.242130 0.275832 0.275819 0.275812 0.275839 0.228859 0.228862 0.228857 0.228863 0.224446 0.226397 0.224453 0.226397 0.224421 0.224478
chargesum: 0.00000
title: Mulliken charges with hydrogens summed into heavy atoms:
elementType: O O C C C C C C C C C C C C C C C C C C
charge: -0.283873 -0.283873 0.004578 0.004577 0.228030 0.227905 0.228078 0.227856 -0.035829 -0.035828 -0.109236 -0.109204 -0.109248 -0.109189 -0.030731 -0.030737 -0.030712 -0.030756 0.139096 0.139097
polarizability: 2.38318474e+02 -4.31522497e-03 2.04190977e+02 3.20052958e-03 -6.87527114e-06 1.29891061e+02
1716.lowfreq: -11.9738 -0.0010 -0.0007 -0.0007 1.9255 8.8712 46.9440 86.9334 91.3304
frequency: 46.9440 86.9260 91.3257 109.7215 132.0579 153.7696 169.7747 183.4766 188.8011 203.6577 210.9995 221.7733 236.4859 246.7288 259.5464 285.9146 294.7246 323.8932 337.8617 346.8213 361.6749 403.9550 436.3153 460.8119 472.9230 505.8116 541.3849 565.4569 591.6818 605.0226 621.4431 628.9527 660.7236 723.4190 760.9806 774.6174 778.9570 781.3424 821.4619 832.4868 843.8934 858.5208 901.7514 902.8405 977.2175 979.6154 997.7132 1001.3193 1001.8294 1003.5110 1031.1271 1033.0883 1043.2417 1051.3308 1064.8924 1072.6715 1079.2386 1083.6619 1093.4825 1121.6697 1122.0009 1141.1538 1160.3023 1163.0139 1171.1419 1172.0046 1207.2923 1216.1381 1220.0495 1268.0799 1273.7746 1292.6142 1373.0876 1377.1307 1380.9451 1387.6870 1424.2442 1428.2186 1430.6300 1436.3095 1454.1763 1456.2757 1458.9828 1460.2872 1463.7322 1466.2666 1473.0353 1479.7030 1481.4974 1484.6495 1577.6504 1598.8729 1608.5472 1614.7158 2954.5909 2956.1605 2992.9489 2993.4018 3037.5809 3038.6259 3098.7517 3099.6863 3100.3086 3101.0068 3101.1349 3101.6348 3123.5175 3123.6160 3133.7858 3134.0315 3145.1887 3145.5765 3160.5398 3161.1180
redmass: 4.2790 3.2478 3.7712 4.0059 2.6583 1.5566 1.2876 1.6562 3.7976 3.0345 2.2048 1.1592 1.0377 2.2423 3.6201 4.1123 3.0010 4.8351 3.8037 4.4831 4.3482 6.5210 3.7184 3.6595 4.3102 3.4994 3.6645 5.3570 3.6314 3.4146 6.2988 5.1185 6.0401 5.8132 4.5448 4.8195 1.2299 1.2760 2.9446 2.7893 2.8088 3.1814 1.3485 1.3427 1.4013 1.3574 6.3453 1.3084 1.3773 7.1222 2.2832 2.8204 3.0462 2.2850 3.5892 3.3544 1.9255 1.6047 1.8346 1.2629 1.2637 1.4519 1.5882 1.5229 1.0578 1.0612 4.3194 3.0393 1.6158 3.9238 1.5256 2.0615 11.1675 1.1967 1.5943 3.1962 1.2735 1.1331 1.8812 1.8391 1.1637 1.1753 1.0790 1.0600 1.0510 1.1079 2.0456 2.2320 1.0525 1.0663 7.3286 7.9524 6.2483 6.3764 1.0316 1.0316 1.0340 1.0340 1.1027 1.1028 1.1003 1.1001 1.1013 1.1010 1.1000 1.1000 1.0847 1.0847 1.0887 1.0888 1.0942 1.0943 1.1006 1.1006
irintensity: 0.2840 0.0000 0.2521 0.3521 0.8949 0.0000 1.5134 0.0000 0.0842 1.1275 8.2891 0.0000 0.0235 0.0000 3.7991 0.0000 2.7065 28.5936 6.0649 1.6101 0.0317 0.0000 2.6150 2.2296 0.0044 0.9702 0.0000 4.6327 3.7745 39.3796 6.0613 0.0000 0.7382 12.6406 0.0000 1.2504 4.4968 126.1365 1.9186 3.7488 8.2266 0.0000 0.0230 0.0000 2.6781 1.3858 19.5635 0.0004 1.9053 103.1130 37.4663 13.4719 6.1313 0.0000 29.8328 42.2723 6.5843 9.8157 0.0000 0.0000 0.1513 3.0542 2.3458 0.6278 3.1913 0.0231 16.7225 0.1187 0.0000 97.0322 3.1845 0.0000 0.7727 3.3592 21.0839 13.3311 1.3338 9.2279 0.0000 19.0910 0.8805 0.0000 0.0000 4.1473 18.7719 4.2998 37.8496 1.8381 5.7472 3.3322 2.2274 1.5407 0.0000 0.1399 0.2365 107.9138 5.7815 26.9431 0.0005 80.2631 28.0281 2.5581 0.0019 52.3673 65.0725 4.4891 0.0009 0.8523 8.1501 0.2551 0.0121 30.3966 69.3438 0.6054
temp: 298.150 k
press: 1.00000 atm
elementType: 8 8 6 6 6 6 6 6 6 6 6 6 6 6 6 6 6 6 6 6 1 1 1 1 1 1 1 1 1 1 1 1 1 1 1 1 1 1 1 1
symmnumber: 1
zpe: 867476.0 jmol-1
zpe.correction: 0.330404 hartree
zpe.thermalcorrener: 0.348925 hartree
zpe.thermalcorrenthalpy: 0.349870 hartree
zpe.thermalcorrgfe: 0.285997 hartree
zpe.sumelectzpe: -846.891082 hartree
zpe.sumelectthermal: -846.872560 hartree
zpe.sumelectthermalent: -846.871616 hartree
zpe.sumelectthermalfe: -846.935489 hartree
dipole: 0.0015 0.0000 -1.1483
dipole: 1.1483
quadrupole: -108.3334 -120.4043 -115.8583
quadrupole: 0.0003 -0.0020 -0.0001
quadrupole: 6.5319 -5.5389 -0.9930 0.0003 -0.0020 -0.0001
hfenergy: -847.2214857 hartree
pointgroup: C01 [X(C18H20O2)]
dipole: 0.0010372 -0.0000906 0.4517623 debye
polarizability: 238.3170711|0.0072212|204.1909749|-0.3898376|0.0157596|129.8924663 unknown
InChI: InChI=1S/C18H20O2/c1-17(19-3)13-9-5-7-11-15(13)18(2,20-4)16-12-8-6-10-14(16)17/h5-12H,1-4H3
charge 0 multiplicity 1
40 atoms
O  0.006185 -2.760231 0.407434
O  0.004858 2.759866 0.4086
C  0.002932 -1.522457 -0.42485
C  0.002259 1.522442 -0.424201
C  1.280684 -0.708147 -0.185016
C  -1.27345 -0.708713 -0.175892
C  1.280373 0.708597 -0.184715
C  -1.27376 0.708028 -0.175585
C  -0.002179 -2.086707 -1.869319
C  -0.00309 2.087296 -1.868433
C  2.505864 -1.403748 -0.01304
C  -2.497087 -1.404836 0.004773
C  2.505264 1.404654 -0.012507
C  -2.497685 1.403547 0.005437
C  3.71748 -0.707504 0.160196
C  -3.707716 -0.709125 0.186789
C  3.717178 0.708862 0.160454
C  -3.708017 0.707237 0.187133
C  0.011168 -2.532105 1.858646
C  0.009142 2.531138 1.85972
H  -0.004948 -1.266408 -2.607691
H  0.894801 -2.708213 -2.030663
H  -0.90013 -2.708475 -2.024163
H  0.893649 2.709211 -2.029532
H  -0.005562 1.267304 -2.607147
H  -0.901283 2.708786 -2.022998
H  2.484545 -2.499321 0.000289
H  -2.475243 -2.500404 0.017792
H  2.483488 2.500213 0.001225
H  -2.476296 2.499118 0.018974
H  4.653885 -1.260055 0.29573
H  -4.642887 -1.262084 0.329014
H  4.65335 1.26176 0.296186
H  -4.643422 1.259731 0.329627
H  0.914983 -1.978802 2.181097
H  0.012353 -3.537024 2.310377
H  -0.89009 -1.978198 2.18715
H  0.009927 3.535869 2.31187
H  0.912877 1.977846 2.182412
H  -0.8922 1.97695 2.187525
