program: Gaussian 09
title: 000232848
version: EM64L-G09RevD.01
frameworkgroup: C1[X(C17H10O)]
method: RPBEPBE
basis: SDD
operation: Freq
keyword: #pfreq=noraman
keyword: PBEPBE/SDD
title: #p freq=noraman PBEPBE/SDD
converged: YES YES NO NO
title: Mulliken charges:
elementType: O C C C C C C C C C C C C C C C C C H H H H H H H H H H
charge: -0.215468 0.021177 0.000464 0.397620 0.489950 0.485613 0.470617 0.167440 -0.474868 -0.499314 -0.484065 -0.475315 -0.478713 -0.459114 -0.456780 -0.409789 -0.240020 -0.211429 0.230014 0.239820 0.244374 0.241472 0.246669 0.246514 0.244974 0.275819 0.231783 0.170554
chargesum: 0.00000
title: Mulliken charges with hydrogens summed into heavy atoms:
elementType: O C C C C C C C C C C C C C C C C C
charge: -0.215468 0.021177 0.000464 0.397620 0.489950 0.485613 0.470617 0.167440 -0.244854 -0.259494 -0.239691 -0.233843 -0.232044 -0.212600 -0.211806 -0.133970 -0.008236 -0.040875
polarizability: 3.44466214e+02 8.65121239e+00 2.16251766e+02 1.86092379e-03 -4.21814017e-05 6.88606286e+01
1716.lowfreq: 0.0003 0.0003 0.0006 7.9542 10.3310 17.4625 63.3039 111.7437 135.4319
frequency: 63.3012 111.7436 135.4314 187.4262 190.3155 214.1551 271.5686 298.4383 323.8732 369.1940 414.0580 414.4997 472.8497 496.9889 500.0768 509.0677 509.4236 547.6374 561.3055 604.2794 633.7570 686.8425 698.7567 737.7978 751.0588 763.5208 771.8219 810.9623 822.1465 848.1599 866.1531 870.9387 886.3310 921.6532 964.0679 968.8353 979.7312 988.7480 994.5971 1009.4811 1048.2751 1096.7692 1114.0144 1157.3492 1176.5695 1185.6174 1199.3910 1227.6482 1243.9920 1250.3258 1259.6545 1335.4059 1363.3940 1388.3627 1405.6011 1411.5335 1428.6857 1432.8360 1443.0135 1467.5463 1490.9707 1510.1075 1539.3252 1577.5681 1597.3287 1601.9801 1614.1238 1635.5103 2916.8178 3123.9549 3125.7498 3129.3217 3131.3013 3133.9475 3148.3749 3156.3031 3159.8222 3165.8602
redmass: 7.3020 4.2724 3.1872 7.7065 3.4101 3.9581 4.5176 3.4741 9.6251 5.0310 3.4266 7.8058 5.4474 5.0830 3.5471 5.8845 3.7094 3.0029 6.6679 3.5173 7.3958 6.9542 3.6656 2.5350 4.8573 5.8927 1.2410 4.7935 1.3321 1.9679 3.2637 5.4621 1.6790 1.4496 1.7526 4.7402 1.3511 1.4064 1.4179 1.4444 3.5449 2.0032 2.3166 1.3450 1.3489 1.3571 1.2875 1.9853 2.4214 1.7190 2.0621 2.9302 2.6251 2.5511 1.9995 2.4929 3.7652 3.5548 2.7413 5.0802 5.1331 3.6695 5.6953 6.0811 5.6407 7.1505 6.7857 7.4876 1.0840 1.0865 1.0864 1.0885 1.0883 1.0918 1.0982 1.0960 1.0989 1.0949
irintensity: 1.0972 0.0981 7.5360 3.4460 1.1504 16.4004 0.7811 0.5976 5.3866 7.8842 0.2185 0.1078 0.1045 7.5738 1.4405 2.3350 2.2437 0.4238 0.0406 4.5131 1.8892 0.4310 1.2775 34.2558 16.7613 23.3437 10.8374 2.4280 1.3951 7.3655 11.5628 14.2269 132.7211 1.8831 3.3415 0.4399 1.4394 1.3711 1.2876 1.0039 10.6013 3.6204 1.4660 0.2086 0.2256 0.6194 24.8549 53.7394 90.2485 2.0112 27.3793 20.4000 2.5828 1.1389 18.0160 9.7181 11.5037 3.7386 5.6683 1.9654 25.6575 50.8200 39.7725 265.5654 152.3271 3.0442 5.0731 3.2165 89.7622 0.8567 0.0726 4.1783 5.0571 15.2645 27.7623 12.1393 37.9477 18.7781
temp: 298.150 k
press: 1.00000 atm
elementType: 8 6 6 6 6 6 6 6 6 6 6 6 6 6 6 6 6 6 1 1 1 1 1 1 1 1 1 1
symmnumber: 1
zpe: 559645.1 jmol-1
zpe.correction: 0.213158 hartree
zpe.thermalcorrener: 0.225460 hartree
zpe.thermalcorrenthalpy: 0.226404 hartree
zpe.thermalcorrgfe: 0.174859 hartree
zpe.sumelectzpe: -727.890894 hartree
zpe.sumelectthermal: -727.878591 hartree
zpe.sumelectthermalent: -727.877647 hartree
zpe.sumelectthermalfe: -727.929192 hartree
dipole: -5.1775 0.3186 0.0003
dipole: 5.1873
quadrupole: -115.1993 -83.9326 -109.0933
quadrupole: 2.8377 0.0013 -0.0009
quadrupole: -12.4576 18.8092 -6.3516 2.8377 0.0013 -0.0009
hfenergy: -728.1040513 hartree
pointgroup: C01 [X(C17H10O1)]
dipole: 2.0364716 0.126862 -0.0409209 debye
polarizability: 344.3848877|-8.5973299|216.1997309|-5.0992096|-2.2355009|68.9939904 unknown
InChI: InChI=1S/C17H10O/c18-10-14-7-6-13-5-4-11-2-1-3-12-8-9-15(14)17(13)16(11)12/h1-10H
charge 0 multiplicity 1
28 atoms
O  -4.952461 -0.721451 0.132446
C  -0.157508 0.324543 0.023971
C  1.217697 -0.095618 0.004701
C  -1.223686 -0.653985 0.060126
C  -0.467155 1.735179 0.006837
C  1.546992 -1.498382 0.021296
C  2.278866 0.882118 -0.03125
C  -2.585875 -0.190245 0.078676
C  -0.856658 -2.056267 0.075916
C  0.468318 -2.45672 0.057279
C  0.612186 2.694504 -0.029257
C  1.934384 2.285622 -0.047602
C  -1.829434 2.151572 0.025973
C  2.911324 -1.897378 0.001918
C  3.630751 0.442067 -0.04975
C  -2.860653 1.206595 0.061134
C  3.941772 -0.93422 -0.033298
C  -3.747725 -1.109266 0.116116
H  -1.636722 -2.821544 0.10314
H  0.719329 -3.5240 0.06981
H  0.359169 3.760849 -0.041853
H  2.745135 3.023045 -0.074991
H  -2.059999 3.222945 0.012837
H  3.156473 -2.965796 0.014689
H  4.434639 1.186926 -0.077146
H  -3.912608 1.511685 0.076391
H  4.988328 -1.256441 -0.048007
H  -3.52748 -2.201741 0.128798
