program: Gaussian 09
title: 000232883
version: EM64L-G09RevD.01
frameworkgroup: C1[X(C27H22O)]
method: RPBEPBE
basis: SDD
operation: Freq
keyword: #pfreq=noraman
keyword: PBEPBE/SDD
title: #p freq=noraman PBEPBE/SDD
converged: YES YES NO NO
title: Mulliken charges:
elementType: O C C C C C C C C C C C C C C C C C C C C C C C C C C C H H H H H H H H H H H H H H H H H H H H H H
charge: -0.306901 -0.009243 0.260385 0.395299 0.174287 -0.704965 0.188192 0.273964 -0.612002 0.377841 0.318309 -0.386421 -0.415420 -0.399364 -0.426870 -0.368448 -0.330389 -0.398689 -0.404520 -0.236999 -0.238340 -0.538015 -0.254315 -0.257924 -0.269793 -0.223004 -0.244888 -0.245236 0.243850 0.246338 0.274690 0.260961 0.237240 0.239274 0.240577 0.263873 0.233014 0.269441 0.285045 0.225238 0.224899 0.227129 0.235411 0.219645 0.227214 0.223682 0.228170 0.222823 0.229704 0.225250
chargesum: 0.00000
title: Mulliken charges with hydrogens summed into heavy atoms:
elementType: O C C C C C C C C C C C C C C C C C C C C C C C C C C C
charge: -0.306901 -0.009243 0.260385 0.395299 0.174287 -0.214778 0.188192 0.273964 -0.337312 0.377841 0.318309 -0.125460 -0.178181 -0.160090 -0.186293 -0.104575 -0.097375 -0.129248 -0.119475 -0.011761 -0.013441 0.144172 -0.027102 -0.034242 -0.041623 -0.000181 -0.015183 -0.019986
polarizability: 3.94808561e+02 1.06564327e+01 2.66136064e+02 -3.42040914e+00 2.82143138e+01 2.38862253e+02
1716.lowfreq: -8.6269 -0.0010 -0.0006 0.0001 2.7344 6.9100 23.5834 29.4527 44.6270
frequency: 23.5475 29.4120 44.6070 46.5332 68.8289 80.2909 94.2419 111.0541 141.5677 150.8760 164.2455 184.1035 208.1588 227.7082 242.6202 254.2332 259.2744 284.6483 295.6851 328.8681 344.2918 373.5290 401.4265 409.5619 416.1733 425.6560 440.8060 473.9587 494.9228 505.0915 520.6426 546.9027 566.0606 592.3496 616.4670 617.8274 629.1726 642.9050 649.1717 673.3369 703.7405 710.2204 714.7187 738.6355 745.0864 759.6964 771.3025 780.6495 811.1342 837.9838 852.0864 854.7955 861.3959 870.0703 892.2678 908.6232 913.8631 933.7757 939.9998 946.9312 958.8820 971.8879 981.6067 985.7218 987.2368 990.2307 991.0883 992.1815 996.2657 999.2705 999.8947 1018.7412 1025.2024 1029.0072 1031.3290 1084.8141 1087.0736 1097.1038 1118.4327 1122.6053 1131.6668 1135.5113 1147.4966 1168.3068 1171.0756 1172.8813 1178.2638 1187.6647 1189.5912 1196.4034 1201.4852 1209.5790 1224.1979 1257.1303 1293.2185 1305.5529 1315.1226 1324.1134 1365.1369 1376.7164 1381.1420 1388.3283 1425.0430 1430.9179 1431.3949 1434.9528 1437.1294 1445.3156 1458.3790 1461.8489 1478.7938 1479.7512 1481.6363 1487.2243 1581.4153 1587.7332 1590.8328 1591.2595 1608.9930 1610.5553 1620.9460 1623.7037 2957.7254 2980.6548 3024.1536 3045.7973 3100.0901 3120.1901 3120.6736 3122.5122 3127.4003 3129.6488 3129.9972 3131.1390 3133.5058 3141.4487 3143.3800 3144.1000 3152.6616 3156.6741 3158.8669 3160.3148 3164.8057 3183.6533
redmass: 4.3616 4.6614 4.1251 4.5741 4.7638 4.3100 4.5122 3.2530 4.1390 3.1656 2.3572 2.4082 2.8222 4.6419 2.2637 4.1693 3.1949 5.2313 5.2238 4.7412 4.8314 4.3186 2.8427 2.8747 4.4570 2.8824 2.9616 4.5057 3.6105 4.2434 3.5612 5.8878 4.2215 3.9872 6.3950 6.3215 6.1710 5.3917 5.6215 6.1861 1.9405 1.6668 2.5517 4.6747 1.7262 2.1255 1.9849 2.2911 4.0134 5.0444 1.5738 1.2557 1.2483 1.3648 2.2590 2.9050 1.9392 1.9623 1.7040 1.4722 3.0310 1.7984 1.3732 1.3404 1.3796 2.2769 2.2621 6.0598 6.3846 1.3132 1.3318 9.3797 2.1487 2.2686 2.1252 1.6199 1.6264 2.0733 1.2674 1.9407 1.1524 1.7675 1.5113 1.1517 1.0555 1.0647 1.8777 1.7645 1.1342 1.1254 1.7943 3.1568 3.3482 2.2499 1.5093 1.8604 1.3497 1.3731 5.5026 8.1759 9.1063 4.2172 1.3896 1.1926 1.8990 2.2701 3.0016 2.3524 1.0543 2.6984 1.6214 1.3302 2.0488 3.3609 6.7608 6.3111 6.6678 6.3568 5.9713 6.0523 7.3679 7.2084 1.0321 1.0608 1.0993 1.1020 1.1003 1.0855 1.0844 1.0846 1.0892 1.0889 1.0885 1.0881 1.0905 1.0946 1.0939 1.0924 1.0955 1.0951 1.0995 1.1003 1.1010 1.0942
irintensity: 0.0408 0.0602 0.2666 0.0385 0.3571 0.0802 0.1552 2.9742 0.8128 1.2504 0.6463 0.0910 0.2343 0.9480 9.1803 0.7928 4.3824 2.4245 15.5573 0.9114 0.2784 0.8716 0.1726 0.2669 3.3953 8.6346 0.0590 9.2641 5.7875 3.8354 2.4404 0.3249 3.2902 0.6176 0.1412 0.1679 6.4951 16.1051 5.3675 7.6168 36.8487 61.8500 13.3861 12.7945 65.5537 46.7568 62.9836 27.6076 0.1957 8.1251 27.6355 0.5049 0.5301 0.3336 2.1486 20.4096 4.0376 3.5154 1.6047 0.0905 6.3531 13.0555 0.4123 0.2567 1.4446 0.6806 2.6878 0.8806 9.1684 0.1219 0.6439 100.7077 2.4091 6.2335 11.4763 6.4090 3.0665 7.8073 0.1928 7.6404 0.0857 4.4284 3.0986 0.4580 0.4806 0.2931 5.9003 0.5391 4.3091 7.6392 4.1326 4.5321 62.4812 3.4429 1.7426 1.3210 3.2205 0.1576 5.6815 3.5904 0.7158 9.7881 10.1622 1.8190 8.2206 19.9817 13.3623 19.7754 3.0176 21.2617 25.4185 4.5500 20.3466 5.8438 0.6607 0.2112 0.5307 0.5921 5.7322 6.2493 1.0797 2.5928 58.8874 13.0090 7.3401 53.6437 26.1278 4.1720 1.8182 1.5769 8.8587 10.5650 6.0729 3.9785 11.0533 30.6600 42.5247 22.4085 27.7761 8.4094 28.1207 44.5357 22.5808 6.7698
temp: 298.150 k
press: 1.00000 atm
elementType: 8 6 6 6 6 6 6 6 6 6 6 6 6 6 6 6 6 6 6 6 6 6 6 6 6 6 6 6 1 1 1 1 1 1 1 1 1 1 1 1 1 1 1 1 1 1 1 1 1 1
symmnumber: 1
zpe: 1056985.1 jmol-1
zpe.correction: 0.402584 hartree
zpe.thermalcorrener: 0.425205 hartree
zpe.thermalcorrenthalpy: 0.426149 hartree
zpe.thermalcorrgfe: 0.350090 hartree
zpe.sumelectzpe: -1115.381506 hartree
zpe.sumelectthermal: -1115.358885 hartree
zpe.sumelectthermalent: -1115.357941 hartree
zpe.sumelectthermalfe: -1115.434000 hartree
dipole: -0.3829 -1.6531 -0.4916
dipole: 1.7666
quadrupole: -154.6425 -154.0801 -151.3061
quadrupole: -0.7566 -1.0555 4.2169
quadrupole: -1.2996 -0.7372 2.0368 -0.7566 -1.0555 4.2169
hfenergy: -1115.7840906 hartree
pointgroup: C01 [X(C27H22O1)]
dipole: -0.1949341 -0.6407958 -0.1856871 debye
polarizability: 395.5079448|-0.971422|266.6631306|5.4097801|27.6860955|237.6358025 unknown
InChI: InChI=1S/C27H22O/c1-28-27(22-11-4-2-5-12-22,23-13-6-3-7-14-23)24-16-17-26-21(19-24)18-20-10-8-9-15-25(20)26/h2-17,19H,18H2,1H3
charge 0 multiplicity 1
50 atoms
O  2.244068 0.116061 2.146504
C  1.798443 -0.063117 0.729214
C  -1.873168 -0.3521 -0.495153
C  0.251628 0.026789 0.65004
C  -2.553172 0.438875 0.478867
C  -2.865876 -0.8680 -1.531541
C  -3.98826 0.47531 0.139804
C  -4.193426 -0.293401 -1.047756
C  -0.486539 -0.557448 -0.414598
C  2.394631 -1.383873 0.194739
C  2.366093 1.175305 -0.009167
C  -0.431558 0.82707 1.605356
C  -1.825457 1.032071 1.533898
C  -5.075965 1.11258 0.777437
C  -5.479666 -0.426295 -1.59854
C  3.710002 -1.406142 -0.336662
C  2.201242 1.29431 -1.412732
C  1.713741 -2.620109 0.352016
C  3.020936 2.213897 0.693261
C  -6.368628 0.976154 0.219858
C  -6.57115 0.213692 -0.957817
C  1.896937 -0.961201 3.07714
C  4.316222 -2.620259 -0.724094
C  2.680826 2.428382 -2.100566
C  2.316767 -3.837306 -0.035094
C  3.500348 3.352593 0.004194
C  3.620531 -3.84311 -0.579885
C  3.332778 3.466714 -1.39375
H  -2.885384 -1.974942 -1.573996
H  -2.614843 -0.518609 -2.552641
H  0.02401 -1.168029 -1.167299
H  0.15593 1.293963 2.402859
H  -2.327176 1.652167 2.285269
H  -4.927097 1.704429 1.687696
H  -5.643502 -1.013824 -2.509507
H  4.260705 -0.466218 -0.445304
H  1.697927 0.498486 -1.973214
H  0.705534 -2.634452 0.779841
H  3.154985 2.115637 1.772746
H  -7.223462 1.46431 0.701455
H  -7.579847 0.119329 -1.375551
H  2.206442 -0.590982 4.067835
H  2.442614 -1.894624 2.843854
H  0.807671 -1.16473 3.083157
H  5.331614 -2.61236 -1.136157
H  2.545139 2.502913 -3.185541
H  1.770097 -4.77845 0.093188
H  4.006453 4.148739 0.562456
H  4.089678 -4.78564 -0.883898
H  3.703386 4.349944 -1.926323
