program: Gaussian 09
title: 000018353
version: EM64L-G09RevD.01
frameworkgroup: C1[X(C6H13O5P)]
method: RPBEPBE
basis: SDD
operation: Freq
keyword: #p
keyword: freq=noraman
keyword: PBEPBE/SDD
title: #p freq=noraman PBEPBE/SDD
converged: YES YES NO NO
title: Mulliken charges:
elementType: P O O O O O C C C C C C H H H H H H H H H H H H H
charge: 1.434301 -0.538531 -0.500826 -0.507357 -0.571751 -0.197800 -0.217615 -0.216072 -0.653740 -0.657380 0.305896 -0.725311 0.235615 0.226058 0.242190 0.217315 0.213129 0.230344 0.236067 0.207659 0.242498 0.237858 0.251066 0.255834 0.250554
chargesum: 0.00000
title: Mulliken charges with hydrogens summed into heavy atoms:
elementType: P O O O O O C C C C C C
charge: 1.434301 -0.538531 -0.500826 -0.507357 -0.571751 -0.197800 0.244058 0.243433 0.025800 0.030635 0.305896 0.032142
polarizability: 1.21788577e+02 -1.69388505e+00 1.11023984e+02 -7.13457446e-01 1.11436765e-01 9.52204955e+01
1716.lowfreq: -16.5338 -0.0028 -0.0021 0.0011 2.7941 9.2713 20.3650 33.4844 34.1482
frequency: 14.6251 33.4633 34.0744 43.1562 51.3923 68.6151 80.0287 104.4644 118.5499 156.8502 210.5423 233.7028 243.8903 260.7405 271.2142 286.4178 294.4514 386.1676 404.2940 455.1861 552.8023 558.1547 626.2082 658.4000 705.4077 809.5389 809.6300 834.2469 877.7350 883.1889 976.6037 1010.6450 1021.3880 1041.2674 1076.4849 1105.5444 1109.3228 1129.0763 1134.0077 1162.6219 1251.3639 1254.9998 1354.0167 1357.2238 1380.7235 1394.3863 1395.9980 1449.9899 1450.5762 1455.9190 1458.0218 1477.1653 1478.0568 1486.8133 1488.5196 1674.5480 2994.2407 2995.8647 2997.7998 3001.8011 3009.9771 3060.6385 3072.1489 3092.6477 3093.7094 3100.8137 3111.8896 3116.8181 3143.2187
redmass: 2.7947 4.4007 2.2567 2.1413 2.2000 3.7641 1.2048 6.3121 6.6347 5.2866 3.1891 1.4360 1.4831 2.7008 5.9072 3.7715 3.9677 5.5768 5.1580 6.7128 3.6679 4.5004 7.9068 7.0432 6.0240 1.0902 1.0939 7.7763 3.9524 4.5742 2.0374 2.4556 2.6566 1.6582 9.4059 2.2222 2.5125 1.3992 1.4251 3.2594 1.1546 1.1466 1.2546 1.2472 1.2267 1.2456 1.2419 1.0554 1.0476 1.0389 1.0402 1.0581 1.0518 1.0771 1.0826 10.3897 1.0435 1.0388 1.0487 1.0561 1.0361 1.1087 1.1063 1.0981 1.0975 1.0971 1.1026 1.1027 1.1018
irintensity: 0.4305 2.4719 0.7814 1.6453 4.7808 2.8692 0.1275 0.4040 0.8995 2.3346 3.5662 2.6223 2.5733 6.6268 11.4418 8.8108 7.3160 23.8778 62.8383 11.8585 15.6093 18.2504 11.9532 172.1167 80.5402 2.7318 2.2604 323.6604 63.8129 277.7057 53.1534 147.7061 94.8938 9.2171 104.5717 7.0977 48.0643 4.7010 6.2431 300.0532 0.5191 0.1178 2.5189 6.7936 48.9345 25.4777 27.8366 25.1952 19.5205 12.2015 13.3461 3.6222 8.0684 11.2349 8.7781 205.6411 20.8141 17.2962 26.8795 26.2737 1.4032 10.4094 10.6352 26.6534 24.0586 5.6257 33.7226 31.7140 9.5497
temp: 298.150 k
press: 1.00000 atm
elementType: 15 8 8 8 8 8 6 6 6 6 6 6 1 1 1 1 1 1 1 1 1 1 1 1 1
symmnumber: 1
zpe: 505027.4 jmol-1
zpe.correction: 0.192355 hartree
zpe.thermalcorrener: 0.208868 hartree
zpe.thermalcorrenthalpy: 0.209813 hartree
zpe.thermalcorrgfe: 0.144460 hartree
zpe.sumelectzpe: -952.793574 hartree
zpe.sumelectthermal: -952.777061 hartree
zpe.sumelectthermalent: -952.776117 hartree
zpe.sumelectthermalfe: -952.841469 hartree
dipole: 1.7710 -0.7762 -5.8047
dipole: 6.1183
quadrupole: -74.0851 -67.4430 -87.1083
quadrupole: -0.3409 6.0557 0.8908
quadrupole: 2.1270 8.7691 -10.8961 -0.3409 6.0557 0.8908
hfenergy: -952.9859291 hartree
pointgroup: C01 [X(C6H13O5P1)]
dipole: 0.7238167 0.1733875 2.289177 debye
dipolederiv: 2.5030367 0.1357259 -0.1571537 -0.3980414 2.1861191 -0.2487743 -0.2272578 0.2787307 1.6344951 -1.5111643 -0.3704317 -0.1847355 -0.3846156 -0.72275 -0.0521476 -0.322882 -0.1127532 -0.5943901 -0.6132856 -0.1790775 0.1210072 -0.1224417 -1.2630365 0.3469458 0.2001833 0.5564731 -0.7390608 -1.8830694 0.638248 0.1601973 0.6379684 -0.8807325 -0.1180901 0.2776953 -0.2668997 -0.6035739 -0.6916889 -0.0169142 0.0398649 0.0343379 -0.6394902 0.0690878 0.0325813 -0.0347851 -0.6506034 -0.8642713 0.1706723 -0.0762953 -0.1376026 -0.4051146 -0.1977448 -0.4044764 -0.0818136 -0.5164755 0.8599191 0.221577 0.1159021 0.5936662 0.4768032 0.1745402 -0.0071223 0.0581468 0.2922672 0.3272027 0.0006977 -0.0558414 0.0616353 0.6583448 -0.2009684 -0.1961449 -0.6325565 0.5298951 -0.1790316 0.0123402 -0.0800094 -0.0620856 0.0126895 -0.0022645 -0.0659597 0.0082465 0.0357281 0.0066433 -0.0741853 -0.0022865 -0.0867111 -0.1528467 0.010335 0.0310463 0.113441 0.0227926 2.0050031 -0.7306824 -0.0233084 -0.2438456 0.7153691 0.4555118 0.511891 0.2496711 0.6567655 -0.1025678 0.0822039 0.0303949 0.0955008 -0.2088812 -0.2215081 0.0411134 -0.2010402 -0.1645165 0.0104112 -0.024648 -0.0257095 -0.0798859 0.0215825 0.022191 0.0386817 0.0847259 -0.088842 -0.0405048 0.0576766 0.0349664 -0.0296814 -0.0964266 -0.0853811 0.0254619 -0.1011051 0.0175307 -0.0872595 0.0277657 -0.0803006 -0.0054599 0.0289224 0.028127 -0.0236817 0.0795636 0.0080848 0.0155355 0.0493538 0.0792323 0.0469795 -0.0590787 -0.0851649 0.0735457 0.0103612 -0.072556 -0.0720372 -0.1148172 -0.0305525 -0.1255808 -0.0255526 -0.003944 -0.0332708 0.0000938 0.1088 0.096713 -0.0106598 0.0637849 0.0313646 0.0757848 0.0809152 0.0213167 0.0741137 -0.1005767 0.0856381 0.0541774 0.0264768 0.108422 -0.0259817 -0.0798519 0.0438854 -0.1008857 0.0190729 0.1042657 -0.0388811 0.0023214 -0.0360812 -0.0246451 0.1034611 0.0086984 0.1194685 -0.0744882 -0.0862326 0.0142357 -0.0628043 0.0569065 0.0952411 0.0147818 -0.0799068 -0.0279005 0.0888064 0.0342393 0.0647607 0.0867795 0.0425291 0.0454233 -0.0695879 0.0640229 -0.1232566 0.0081736 -0.0855435 0.0655627 0.0129451 0.0468981 0.0879102 -0.031796 -0.0064775 -0.0338283 0.0960471 0.0610825 -0.0834883 0.0485402 -0.0626772 0.0039298 0.0059199 0.0348641 0.0393728 0.1101553 0.1069665 0.0487881 -0.0434157 0.0185019 0.0964162 0.0854071 -0.0378074 0.044416 -0.0235313 unknown
polarizability: 122.0003424|0.7328138|110.7960939|0.7022579|0.5359576|95.2366207 unknown
InChI: InChI=1S/C6H13O5P/c1-4-9-12(8,10-5-2)11-6(3)7/h4-5H2,1-3H3
charge 0 multiplicity 1
25 atoms
P  0.27302 0.016741 -0.713895
O  1.713549 -0.157826 0.20987
O  -0.384754 -1.54962 -0.598385
O  -0.606531 1.045601 0.470682
O  0.394686 0.61995 -2.165992
O  -2.694983 0.89193 -0.581183
C  2.710614 0.959145 0.21588
C  -0.416692 -2.277718 0.715101
C  3.986725 0.385046 0.821703
C  -1.117758 -3.599532 0.425858
C  -1.974748 1.39348 0.297485
C  -2.362205 2.425973 1.331712
H  2.864693 1.307739 -0.82248
H  2.29962 1.785638 0.825036
H  0.62247 -2.413166 1.063041
H  -0.973371 -1.665796 1.450045
H  4.762372 1.171523 0.872401
H  3.800861 0.01271 1.843434
H  4.36987 -0.446742 0.207347
H  -1.178122 -4.199955 1.352817
H  -2.139559 -3.424487 0.050485
H  -0.560525 -4.177306 -0.33023
H  -3.442164 2.623872 1.270772
H  -1.803407 3.360307 1.148161
H  -2.094659 2.076095 2.342837
