program: Gaussian 09
title: 000232855
version: EM64L-G09RevD.01
frameworkgroup: C1[X(C18H14N2O4)]
method: RPBEPBE
basis: SDD
operation: Freq
keyword: #p
keyword: freq=noraman
keyword: PBEPBE/SDD
title: #p freq=noraman PBEPBE/SDD
converged: YES YES NO NO
title: Mulliken charges:
elementType: O O O O N N C C C C C C C C C C C C C C C C C C H H H H H H H H H H H H H H
charge: -0.256127 -0.256127 -0.423067 -0.423067 -0.429008 -0.429007 0.220500 0.220496 0.063990 0.063989 -0.376729 -0.376725 0.456915 0.456908 -0.364786 -0.364785 -0.355872 -0.355878 -0.393329 -0.393329 -0.362179 -0.362176 0.283413 0.283413 0.347756 0.347758 0.268684 0.268684 0.241669 0.241670 0.234554 0.234560 0.225653 0.225653 0.258422 0.258422 0.359543 0.359543
chargesum: 0.00000
title: Mulliken charges with hydrogens summed into heavy atoms:
elementType: O O O O N N C C C C C C C C C C C C C C C C C C
charge: -0.256127 -0.256127 -0.063524 -0.063524 -0.081252 -0.081250 0.220500 0.220496 0.063990 0.063989 -0.108045 -0.108041 0.456915 0.456908 -0.123117 -0.123115 -0.121319 -0.121318 -0.167677 -0.167676 -0.103757 -0.103754 0.283413 0.283413
polarizability: 6.43872275e+02 -1.55653673e+01 2.18278344e+02 -2.22505002e-04 3.78650846e-04 1.01714011e+02
1716.lowfreq: -2.6746 -0.0007 0.0003 0.0009 2.3888 3.0944 16.5234 27.0266 35.4235
frequency: 16.5135 27.0239 35.4133 60.9458 63.0606 69.0155 103.7254 150.6936 157.0417 168.5788 194.2471 201.1274 228.9795 248.3266 277.1607 342.8788 353.2433 373.8614 373.9879 390.1077 392.7645 413.6166 415.0944 431.0548 466.9208 474.3385 483.6227 492.6157 528.6321 544.4069 553.5299 562.9480 599.7410 630.4782 635.2590 672.1756 705.4149 709.7506 720.0004 733.7422 748.0563 753.9113 757.3284 786.2399 792.0677 810.0646 811.6025 834.2046 836.9131 848.4499 849.1495 898.0363 901.6962 918.3914 945.3989 946.0308 963.8857 963.9252 999.1361 999.1558 1105.7117 1110.4043 1140.4348 1144.5176 1146.7220 1181.5718 1185.2473 1189.3416 1215.3853 1230.4346 1258.7525 1258.9604 1304.2467 1309.9468 1318.0418 1320.5863 1379.1173 1383.8198 1385.2123 1389.7989 1409.1812 1420.6113 1436.6253 1437.6644 1502.6520 1503.7726 1578.4952 1579.1502 1590.4063 1607.2531 1623.4660 1623.6024 1645.4265 1648.1654 3117.0383 3117.0799 3126.9770 3127.0784 3138.3954 3138.4203 3145.7461 3145.7553 3173.5345 3173.5552 3506.6450 3508.0445 3580.3862 3580.5782
redmass: 7.9933 5.8798 4.1179 6.8489 6.9960 5.1497 8.2281 8.1306 6.3097 5.5979 6.1271 8.1597 6.7013 5.9801 7.6206 4.8238 5.9596 1.1214 1.1266 3.9326 4.0848 3.0016 3.0652 9.1366 9.5209 5.5516 4.3676 3.9124 2.3692 3.3560 5.4883 6.0108 6.4576 6.8927 6.9674 1.7444 2.7366 5.1106 3.7470 4.8717 4.8810 2.1944 2.2307 5.7995 3.6879 1.3698 1.5429 1.7483 1.6094 3.5364 3.2752 1.4345 1.4453 3.1728 1.3993 1.4112 1.3319 1.3258 2.7875 2.7843 1.6616 1.4895 1.7528 1.3445 1.7487 1.7176 1.1199 1.5466 1.7938 2.1072 2.7844 2.7233 4.0746 2.4622 1.3885 1.3287 4.4998 5.5011 2.2767 1.8332 2.4556 2.8831 3.1113 2.9076 2.7749 2.8083 6.0477 5.9480 7.7240 5.2455 6.1044 6.4099 5.3764 7.9632 1.0883 1.0883 1.0882 1.0880 1.0889 1.0889 1.0959 1.0959 1.0957 1.0957 1.0758 1.0758 1.0660 1.0661
irintensity: 1.2611 0.6177 1.5401 0.3499 0.0299 0.7429 1.0164 6.2807 0.2791 0.0232 1.8892 0.0000 0.2813 0.0004 1.6268 1.7056 1.4075 51.5887 242.5009 0.1866 30.8291 0.2377 0.6742 115.6376 0.0001 0.2982 0.0013 20.3396 76.1265 18.5035 4.9977 9.7463 1.4098 2.5366 0.3795 0.2588 20.6406 8.7538 2.0019 4.7041 11.3936 13.9008 134.7641 27.3986 0.1634 8.8429 70.5620 4.9425 20.1377 4.1635 53.1004 48.2642 13.9051 80.1240 4.5652 1.6839 1.5933 2.3088 4.4933 0.0243 217.1879 0.9613 563.6996 6.1361 229.1572 0.1819 103.9716 0.2127 0.1503 39.1368 254.3118 0.0061 812.7110 0.0986 249.2994 1.0677 171.3136 0.7770 0.0085 194.1907 294.2894 0.4652 27.3773 0.0193 217.4492 1.2556 1.3538 31.0878 3.3284 553.2540 328.5379 0.0054 3.4039 16.3875 47.0840 0.1888 12.8878 0.0490 18.2939 5.2429 17.4625 3.5734 9.7285 1.4533 58.3076 0.9453 221.5910 0.2584
temp: 298.150 k
press: 1.00000 atm
elementType: 8 8 8 8 7 7 6 6 6 6 6 6 6 6 6 6 6 6 6 6 6 6 6 6 1 1 1 1 1 1 1 1 1 1 1 1 1 1
symmnumber: 1
zpe: 744733.0 jmol-1
zpe.correction: 0.283654 hartree
zpe.thermalcorrener: 0.304006 hartree
zpe.thermalcorrenthalpy: 0.304950 hartree
zpe.thermalcorrgfe: 0.232752 hartree
zpe.sumelectzpe: -1103.061400 hartree
zpe.sumelectthermal: -1103.041048 hartree
zpe.sumelectthermalent: -1103.040103 hartree
zpe.sumelectthermalfe: -1103.112302 hartree
dipole: 0.0000 0.0000 -0.9842
dipole: 0.9842
quadrupole: -71.5533 -153.6976 -142.6639
quadrupole: -21.1894 -0.0002 0.0003
quadrupole: 51.0850 -31.0594 -20.0256 -21.1894 -0.0002 0.0003
hfenergy: -1103.3450538 hartree
pointgroup: C01 [X(C18H14N2O4)]
dipole: 0.0000329 -0.0001267 -0.3871947 debye
polarizability: 644.3616062|-5.8122803|217.7889967|0.0544139|-0.0361943|101.7140269 unknown
InChI: InChI=1S/C18H14N2O4/c21-13-5-1-11(2-6-13)9-15-17(23)20-16(18(24)19-15)10-12-3-7-14(22)8-4-12/h1-10,19-22H
charge 0 multiplicity 1
38 atoms
O  0.197171 -2.732394 -0.354553
O  -0.197098 2.732167 -0.356301
O  7.828529 1.072813 0.250928
O  -7.828549 -1.07274 0.250073
N  -1.100971 -0.813194 -0.274784
N  1.101029 0.813018 -0.275065
C  -1.335716 0.579163 -0.214865
C  1.335762 -0.579303 -0.214235
C  0.136284 -1.466588 -0.289239
C  -0.136223 1.466402 -0.290182
C  -2.58041 1.16755 -0.14981
C  2.58044 -1.167658 -0.148574
C  -3.905517 0.55748 -0.030994
C  3.905532 -0.557529 -0.029884
C  -5.033901 1.310218 -0.476663
C  5.033989 -1.310548 -0.474895
C  -4.163034 -0.729743 0.541173
C  4.162958 0.730031 0.541563
C  -6.341845 0.799525 -0.404573
C  6.341925 -0.799827 -0.402872
C  -5.466133 -1.247843 0.627324
C  5.466047 1.248168 0.627641
C  6.558308 0.490806 0.141917
C  -6.558314 -0.490785 0.140948
H  -1.907025 -1.438412 -0.370076
H  1.907101 1.438179 -0.370582
H  -2.542027 2.261072 -0.231467
H  2.542062 -2.261229 -0.229562
H  -4.870909 2.308824 -0.898143
H  4.871059 -2.309403 -0.895807
H  -3.352043 -1.307841 0.997852
H  3.351893 1.308403 0.997757
H  -7.18676 1.400331 -0.764971
H  7.1869 -1.400858 -0.762755
H  -5.660475 -2.224811 1.079052
H  5.660319 2.225403 1.078822
H  8.529936 0.472489 -0.105323
H  -8.529894 -0.472638 -0.106673
