program: Gaussian 09
title: 000232856
version: EM64L-G09RevD.01
frameworkgroup: C1[X(C18H19BrO)]
method: RPBEPBE
basis: SDD
operation: Freq
keyword: #p
keyword: freq=noraman
keyword: PBEPBE/SDD
title: #p freq=noraman PBEPBE/SDD
converged: YES YES NO NO
title: Mulliken charges:
elementType: Br O C C C C C C C C C C C C C C C C C C H H H H H H H H H H H H H H H H H H H
charge: 0.020450 -0.184601 0.062147 0.315037 -0.508890 -0.547584 -0.425834 -0.414836 0.227181 0.268388 0.359741 -0.675196 -0.570395 -0.411515 -0.550004 0.347807 -0.424575 -0.684212 0.161485 -0.820129 0.223303 0.224307 0.227447 0.222075 0.205809 0.213316 0.206801 0.210896 0.239747 0.209211 0.232047 0.249903 0.249834 0.279270 0.228134 0.221445 0.227879 0.292812 0.291301
chargesum: 0.00000
title: Mulliken charges with hydrogens summed into heavy atoms:
elementType: Br O C C C C C C C C C C C C C C C C C C
charge: 0.020450 -0.184601 0.062147 0.315037 -0.061280 -0.098062 -0.006709 0.002861 0.227181 0.268388 0.359741 -0.435449 -0.129137 -0.161613 -0.300171 0.347807 -0.145305 -0.006753 0.161485 -0.236017
polarizability: 3.54756740e+02 -1.85148567e+01 2.22371375e+02 5.06055624e+00 -8.45921767e+00 1.11484391e+02
1716.lowfreq: -5.7194 0.0003 0.0005 0.0006 1.4098 8.2204 19.6262 53.8090 59.1294
frequency: 19.4300 53.8030 59.1005 62.4773 69.8938 96.9285 116.0032 121.3915 150.2488 176.4209 191.9568 198.3305 239.8957 263.3895 288.7926 303.9676 316.3007 360.0740 372.0166 408.9282 446.9105 458.8582 477.9284 493.8886 512.4773 547.1483 574.3333 582.5537 625.5615 632.5413 673.2652 684.5496 710.4626 719.5220 788.5802 790.2428 825.4853 829.6751 846.1606 875.7843 878.1569 888.1825 900.3730 921.9257 923.8423 937.1054 977.3607 980.8383 995.0540 1001.2938 1036.8910 1063.2367 1083.2413 1089.3606 1102.5599 1112.0596 1127.6422 1134.8424 1167.1268 1179.4731 1192.8432 1221.0883 1244.1027 1244.5377 1250.0534 1265.3335 1278.0335 1288.9510 1306.5502 1317.3903 1336.2548 1345.2164 1356.2775 1359.8507 1383.9419 1394.4267 1408.4006 1417.4111 1432.2649 1453.1464 1457.2356 1465.1678 1471.0895 1471.6348 1475.7236 1483.6669 1495.9726 1505.0269 1582.5145 1598.0974 1606.2324 1623.5586 2954.5770 2955.1973 2979.4737 2982.3418 2983.1377 2987.0185 3014.2781 3017.3257 3033.5762 3036.5609 3043.7291 3051.2045 3080.4207 3085.6168 3103.8690 3110.0204 3148.4664 3151.3361 3169.6725
redmass: 8.1966 4.8678 3.4927 4.2966 2.9866 2.9041 3.0089 3.1372 9.8554 3.6740 4.3485 1.1582 3.5919 2.8113 2.8122 2.3353 3.9718 4.2490 3.6393 3.3945 2.9487 3.8080 3.1183 3.3066 5.1954 3.4970 3.1531 2.9955 3.9350 4.3450 4.3640 3.7278 3.5801 5.9311 1.2619 2.6686 1.5731 2.8423 1.6326 2.6545 2.0621 2.0880 1.8750 1.7004 1.5129 2.4855 2.7501 3.0746 3.3448 1.3463 2.4821 1.8517 1.8944 1.8183 1.6621 2.2706 1.1224 1.1532 1.4491 1.4908 1.7406 1.6296 1.3554 1.6222 1.2824 1.3070 2.3605 1.5974 1.6138 1.5502 1.4741 1.4574 1.7592 2.0089 1.8362 1.8992 1.1528 5.1354 3.1596 1.2527 1.1858 2.2056 1.0959 1.0440 1.1088 1.1244 1.2227 2.6790 7.4965 8.8640 6.1301 6.8252 1.0640 1.0644 1.0658 1.0620 1.0358 1.0607 1.0932 1.0943 1.0567 1.0997 1.0981 1.1041 1.0999 1.1006 1.0908 1.1067 1.0868 1.0896 1.0968
irintensity: 0.2269 4.2579 2.3989 1.5518 0.4452 0.2701 0.1433 2.4088 0.1145 0.0581 0.3938 0.2799 3.1595 0.6106 0.6204 2.8653 3.2348 1.2512 2.3310 4.4267 1.2079 0.8792 3.7956 3.3446 0.5733 3.6358 1.7939 1.3237 16.1982 32.4247 25.0557 5.7199 0.5317 2.3655 3.1459 1.5373 18.7443 8.3068 37.3047 7.4664 6.1359 0.8981 9.0765 0.0750 11.5315 8.6899 5.6390 15.2004 38.9812 0.7837 3.5086 8.9739 2.6730 9.5652 0.4743 6.7928 3.0119 2.0399 9.0374 14.6211 229.6866 9.7220 5.7683 40.9498 3.4781 2.1815 23.2588 6.4939 6.3969 0.2892 0.3369 3.6377 10.4143 8.0429 4.2331 8.4792 21.0693 41.3444 3.0182 2.3288 12.9746 17.3681 13.3683 11.5211 7.9150 2.2303 13.5146 14.7195 9.3776 186.4521 25.6164 35.9351 29.5089 15.2622 39.7760 27.8758 36.7258 31.0838 42.5142 20.4335 28.8519 7.2136 77.6200 59.5422 50.6730 34.1100 26.6729 1.3593 4.5006 13.3880 10.0613
temp: 298.150 k
press: 1.00000 atm
elementType: 35 8 6 6 6 6 6 6 6 6 6 6 6 6 6 6 6 6 6 6 1 1 1 1 1 1 1 1 1 1 1 1 1 1 1 1 1 1 1
symmnumber: 1
zpe: 837898.3 jmol-1
zpe.correction: 0.319139 hartree
zpe.thermalcorrener: 0.337741 hartree
zpe.thermalcorrenthalpy: 0.338685 hartree
zpe.thermalcorrgfe: 0.270453 hartree
zpe.sumelectzpe: -784.579260 hartree
zpe.sumelectthermal: -784.560657 hartree
zpe.sumelectthermalent: -784.559713 hartree
zpe.sumelectthermalfe: -784.627945 hartree
dipole: -6.4454 3.1709 -0.3374
dipole: 7.1911
quadrupole: -134.3784 -122.7444 -130.2342
quadrupole: 11.8025 -1.2075 -0.7245
quadrupole: -5.2594 6.3746 -1.1152 11.8025 -1.2075 -0.7245
hfenergy: -784.8983983 hartree
pointgroup: C01 [X(C18H19Br1O1)]
dipole: 2.5803644 -1.1522066 -0.1356474 debye
polarizability: 356.0032277|-13.7048697|220.7226179|-3.1947166|10.9229364|111.8866598 unknown
InChI: InChI=1S/C18H19BrO/c1-2-12-9-13-5-3-4-6-15(13)16-8-7-14(10-17(12)16)18(20)11-19/h7-10H,2-6,11H2,1H3
charge 0 multiplicity 1
39 atoms
Br -6.459258 -0.285162 -0.123746
O  -4.295757 1.909376 0.258471
C  2.115068 0.694411 0.036306
C  2.785866 -0.531485 -0.12871
C  2.888043 2.001678 0.209067
C  4.308175 -0.631272 -0.134021
C  4.389591 1.88601 -0.137004
C  4.997038 0.607166 0.473973
C  0.67029 0.701427 0.053535
C  -0.076939 -0.531708 -0.12808
C  0.638575 -1.777168 -0.310141
C  2.033318 -1.738382 -0.303277
C  -0.081216 -3.111376 -0.459422
C  -0.074417 1.916521 0.253468
C  -1.506259 -0.481897 -0.122826
C  -2.207844 0.721291 0.066211
C  -1.464388 1.933083 0.263685
C  -0.574264 -3.69253 0.895047
C  -3.705067 0.811704 0.075012
C  -4.471307 -0.503705 -0.154813
H  2.434276 2.791866 -0.419779
H  2.780071 2.348804 1.258559
H  4.614543 -1.55011 0.402831
H  4.654976 -0.761693 -1.18127
H  4.517168 1.85453 -1.237749
H  4.920886 2.786553 0.223675
H  4.850974 0.61843 1.572622
H  6.086657 0.563223 0.289398
H  2.589653 -2.676558 -0.433049
H  -0.939525 -3.020185 -1.153053
H  0.609771 -3.839167 -0.923595
H  0.465088 2.855288 0.407538
H  -2.053216 -1.417197 -0.274425
H  -2.026263 2.859592 0.41769
H  0.276748 -3.858266 1.579469
H  -1.087362 -4.659717 0.74305
H  -1.276671 -3.005996 1.401003
H  -4.228609 -0.931403 -1.141569
H  -4.235212 -1.24028 0.630921
