program: Gaussian 09
title: 000232857
version: EM64L-G09RevD.01
frameworkgroup: C1[X(C18H20O2)]
method: RPBEPBE
basis: SDD
operation: Freq
keyword: #pfreq=noraman
keyword: PBEPBE/SDD
title: #p freq=noraman PBEPBE/SDD
converged: YES YES NO NO
title: Mulliken charges:
elementType: O O C C C C C C C C C C C C C C C C C C H H H H H H H H H H H H H H H H H H H H
charge: -0.459236 -0.451480 0.044331 -0.171492 0.086125 0.215034 0.242473 0.408859 -0.401437 -0.437940 -0.368010 -0.395256 -0.368774 -0.424582 -0.719832 -0.692351 -0.259258 -0.248464 -0.257793 -0.254032 0.206441 0.234126 0.215968 0.225782 0.281799 0.283749 0.282603 0.222981 0.341079 0.342769 0.232656 0.241473 0.215286 0.212800 0.243428 0.219243 0.227503 0.228648 0.227570 0.227211
chargesum: 0.00000
title: Mulliken charges with hydrogens summed into heavy atoms:
elementType: O O C C C C C C C C C C C C C C C C C C
charge: -0.118157 -0.108711 0.044331 -0.171492 0.086125 0.215034 0.242473 0.408859 0.039130 0.003810 -0.086211 -0.111507 -0.086171 -0.201601 -0.030417 -0.016880 -0.031755 -0.019815 -0.030224 -0.026821
polarizability: 2.37209062e+02 1.14453916e+00 2.08383316e+02 -5.64831173e+00 5.68089378e-02 1.32873838e+02
1716.lowfreq: -12.1573 -6.5682 -0.0006 -0.0003 0.0003 9.7633 49.2910 78.0897 84.5002
frequency: 49.2246 78.0491 84.4915 90.8196 114.2281 127.9133 157.4678 176.0779 217.2619 219.7978 234.5070 251.1143 270.3651 276.8143 300.0655 309.0114 312.7970 340.0593 344.7976 363.4237 379.5757 389.5469 416.0927 450.4955 488.9388 522.2816 540.9432 566.5832 576.7129 587.7490 630.9057 652.1446 663.2238 727.1314 751.0905 754.8712 763.1824 768.0640 775.5117 780.3914 868.4088 880.5995 890.6054 897.9693 907.8422 927.2540 936.4625 944.0527 957.5262 972.5982 992.8558 996.0572 1039.0829 1044.8315 1049.8380 1058.9874 1072.2083 1076.0065 1086.3144 1096.9852 1102.2029 1136.0784 1162.4521 1172.8862 1174.8923 1183.9593 1205.9266 1226.1207 1241.9862 1267.1417 1273.8766 1275.9307 1306.0085 1317.6183 1334.0087 1341.3218 1372.8036 1386.4672 1387.8564 1388.9798 1433.9187 1434.4096 1446.9270 1460.3500 1467.5781 1470.1569 1474.3458 1478.9306 1487.9328 1492.9184 1577.9160 1596.6056 1607.1275 1613.6097 2960.7701 2988.4162 2988.8432 2997.4075 3044.9248 3051.7530 3078.3830 3080.5421 3094.0298 3102.5046 3122.1648 3126.3325 3133.7124 3145.3191 3148.5952 3162.7949 3163.2574 3177.6181 3543.8934 3560.6336
redmass: 4.1695 3.1953 3.6381 3.1191 2.1251 3.6652 2.1815 3.3460 1.3918 4.1642 1.5287 1.3386 2.9854 3.0126 2.9539 2.7264 2.9018 2.7743 3.0931 5.1628 1.5106 3.7286 3.3827 3.4601 3.4215 3.6737 3.7801 3.9001 3.3352 4.0241 5.8514 5.8636 5.8497 5.3243 2.7311 2.0972 1.5865 1.3473 1.6576 1.4602 1.5086 2.4198 1.7800 2.2056 2.7738 2.8891 3.8819 2.4684 1.4078 1.4150 1.3166 1.3052 2.4425 2.1096 2.3519 2.5369 2.7762 2.1242 2.0746 1.9424 1.8667 1.7860 1.7519 1.0652 1.1243 2.3430 1.9539 2.1446 1.5292 1.2954 1.5644 1.4791 1.5315 1.4596 1.4435 1.7596 8.9461 8.1593 1.2083 1.2397 1.7366 2.2480 1.3084 1.3430 1.6969 1.0697 1.0872 2.3523 1.0534 1.0559 6.9632 7.7350 6.3981 6.4982 1.0673 1.0368 1.0363 1.0593 1.0931 1.0991 1.0987 1.0990 1.1000 1.1008 1.0849 1.0858 1.0890 1.0916 1.0936 1.0968 1.0990 1.0956 1.0656 1.0659
irintensity: 0.2080 0.0781 0.3334 0.6919 0.8956 1.2768 1.3313 0.0056 6.1230 11.2891 94.5825 3.2455 0.1681 0.9176 3.9240 4.9849 9.5986 18.6422 1.3350 2.9081 120.2137 0.9182 37.5893 9.0038 1.1793 8.2039 0.1320 2.8241 34.9554 0.3059 15.2012 1.1003 0.2936 7.5108 2.8384 26.2044 56.4182 9.0546 20.3133 45.7862 7.8942 23.2074 4.9109 16.0240 28.4637 32.6826 39.7670 16.1843 0.0801 1.1079 0.1547 0.1611 1.9098 16.7455 21.7510 2.4806 0.0303 28.7584 10.1717 0.3252 7.4587 23.7034 20.1944 1.7348 1.5893 3.1128 4.7852 19.4951 8.0396 19.2180 10.2013 1.1570 37.8276 3.3280 5.8668 26.0349 4.6545 0.8628 15.5456 16.4423 1.2512 16.7965 2.5291 6.3836 37.2234 6.8511 4.9188 8.8247 12.5626 13.3337 1.5247 0.5689 0.0526 0.2139 33.1365 30.9512 40.4111 19.5859 12.0042 8.7738 36.7198 35.4027 34.0293 26.2453 1.9814 4.0875 13.6393 20.3678 18.4822 35.1309 14.0705 12.1661 8.2270 7.1986
temp: 298.150 k
press: 1.00000 atm
elementType: 8 8 6 6 6 6 6 6 6 6 6 6 6 6 6 6 6 6 6 6 1 1 1 1 1 1 1 1 1 1 1 1 1 1 1 1 1 1 1 1
symmnumber: 1
zpe: 868329.5 jmol-1
zpe.correction: 0.330729 hartree
zpe.thermalcorrener: 0.349161 hartree
zpe.thermalcorrenthalpy: 0.350106 hartree
zpe.thermalcorrgfe: 0.286212 hartree
zpe.sumelectzpe: -846.911750 hartree
zpe.sumelectthermal: -846.893318 hartree
zpe.sumelectthermalent: -846.892374 hartree
zpe.sumelectthermalfe: -846.956268 hartree
dipole: -0.7484 -1.2194 1.2521
dipole: 1.9013
quadrupole: -109.3543 -113.7138 -120.0740
quadrupole: 2.9397 -0.8845 -5.5365
quadrupole: 5.0264 0.6669 -5.6933 2.9397 -0.8845 -5.5365
hfenergy: -847.2424795 hartree
pointgroup: C01 [X(C18H20O2)]
dipole: -0.2961936 -0.4855333 0.4858565 debye
polarizability: 237.2667698|1.2668396|208.3799606|-5.0147871|0.8324133|132.8194859 unknown
InChI: InChI=1S/C18H20O2/c1-3-17(19)13-9-5-7-11-15(13)18(20,4-2)16-12-8-6-10-14(16)17/h5-12,19-20H,3-4H2,1-2H3
charge 0 multiplicity 1
40 atoms
O  -0.149366 2.755078 -0.639474
O  -0.056064 -2.799953 -0.690227
C  -0.091161 1.474153 0.115498
C  -0.079891 -1.540499 0.092407
C  1.14876 0.678504 -0.316266
C  -1.374879 0.669734 -0.144338
C  1.149362 -0.742685 -0.351432
C  -1.371003 -0.74924 -0.17763
C  -0.057765 1.942822 1.606764
C  -0.029488 -1.912179 1.619023
C  2.312542 1.380458 -0.724176
C  -2.59212 1.370625 -0.338083
C  2.302127 -1.428381 -0.806406
C  -2.584666 -1.435468 -0.425683
C  1.152947 2.810138 2.00068
C  1.206628 -2.72342 2.056453
C  3.462437 0.691043 -1.160718
C  -3.798163 0.678683 -0.569571
C  3.454924 -0.72192 -1.206626
C  -3.793202 -0.734669 -0.618678
H  -0.113735 1.051169 2.258129
H  -0.991439 2.514509 1.769498
H  -0.957588 -2.480602 1.843882
H  -0.094756 -0.982767 2.212911
H  2.293825 2.474162 -0.709457
H  -2.57101 2.465114 -0.321305
H  2.265176 -2.518572 -0.869678
H  -2.587528 -2.528626 -0.49919
H  -0.179389 2.535719 -1.606645
H  -0.636197 -3.462323 -0.236538
H  2.100998 2.249762 1.92479
H  1.220189 3.698729 1.350651
H  1.044777 3.15399 3.045927
H  1.324438 -3.637347 1.446847
H  2.132788 -2.132323 1.956041
H  1.106909 -3.027433 3.114412
H  4.350952 1.251185 -1.473255
H  -4.730835 1.233592 -0.720154
H  4.335503 -1.26916 -1.561237
H  -4.720437 -1.284703 -0.814148
