program: Gaussian 09
title: 000232853
version: EM64L-G09RevD.01
frameworkgroup: C1[X(C17H17BrO)]
method: RPBEPBE
basis: SDD
operation: Freq
keyword: #p
keyword: freq=noraman
keyword: PBEPBE/SDD
title: #p freq=noraman PBEPBE/SDD
converged: YES YES NO NO
title: Mulliken charges:
elementType: Br O C C C C C C C C C C C C C C C C C H H H H H H H H H H H H H H H H H
charge: 0.009837 -0.190959 -0.216236 -0.433077 0.367862 0.074053 -0.454133 -0.515834 0.209852 -0.733574 -0.643286 0.248880 0.193986 -0.401837 -0.345031 0.125050 -0.266208 -0.278445 -0.823411 0.232069 0.205059 0.210822 0.211324 0.213617 0.225105 0.230621 0.221167 0.231327 0.223113 0.279130 0.249387 0.252822 0.230926 0.235619 0.305100 0.315302
chargesum: 0.00000
title: Mulliken charges with hydrogens summed into heavy atoms:
elementType: Br O C C C C C C C C C C C C C C C C C
charge: 0.009837 -0.190959 0.015833 -0.017196 0.367862 0.074053 -0.029192 -0.060108 0.209852 -0.057967 -0.364156 0.248880 0.193986 -0.152450 -0.092209 0.125050 -0.035282 -0.042826 -0.203009
polarizability: 2.88661641e+02 7.42825719e+00 2.39385403e+02 -6.25020849e+00 4.19005694e+00 1.10381019e+02
1716.lowfreq: -5.7907 -1.6964 -0.0006 -0.0005 -0.0004 5.2210 28.9098 49.9215 57.8165
frequency: 28.8171 49.8476 57.8054 80.5030 98.7384 130.0475 139.9957 168.5960 189.8243 207.3498 227.0647 255.5295 269.6230 296.3607 331.6688 353.1295 387.5898 426.6181 434.2996 455.0753 472.3480 500.2365 522.9959 565.6186 571.2687 584.4668 619.0125 653.0958 683.9559 695.9233 715.5882 767.0936 779.3307 797.4422 834.5330 859.4665 870.9026 880.0398 890.2794 902.9969 925.2902 951.3361 969.7345 972.1262 982.0695 999.0060 1023.5677 1038.5902 1043.5907 1066.6230 1098.6284 1108.5786 1128.2613 1161.4015 1171.8342 1183.4259 1186.6554 1194.8997 1224.7017 1225.8781 1260.9000 1266.2284 1293.5071 1296.6792 1301.6323 1334.7034 1345.7365 1360.3668 1374.2815 1381.4981 1390.3570 1405.9019 1429.7725 1436.5749 1444.9577 1461.4219 1463.9696 1474.2736 1475.4310 1485.8819 1520.4352 1551.9866 1573.7487 1597.0193 1621.2713 2955.0855 2966.4883 2978.4539 2984.6550 2991.2872 3018.6230 3039.5673 3051.1230 3063.4001 3075.7394 3079.0754 3131.0396 3131.3316 3144.3188 3155.6770 3159.3150 3169.6502
redmass: 8.6249 3.6117 8.6477 3.5524 4.2467 6.2810 3.0775 4.6662 1.8847 1.7699 3.5759 2.9560 2.6375 3.2204 4.1930 3.4431 3.5719 3.3680 2.7302 3.9917 4.5543 3.9909 3.6520 4.3400 3.9075 3.5641 5.1496 3.4673 3.7631 3.5084 3.8080 2.2683 2.1449 3.1509 2.8449 1.5429 2.5998 1.7763 1.7331 2.1527 2.5444 2.0122 1.3700 2.1168 1.7214 1.3253 2.0154 2.2383 2.3213 1.7384 1.9386 1.7527 1.5018 1.6367 1.4909 1.6455 1.1536 1.6322 1.3670 1.4278 1.8329 1.3083 1.8400 1.9278 1.4759 1.4998 1.4414 1.5453 3.5117 2.0435 1.4501 5.7654 1.9198 1.3969 1.6749 1.3412 1.1395 1.0843 1.0706 1.0782 3.3897 8.8721 7.0772 7.1983 6.0823 1.0648 1.0762 1.0368 1.0670 1.0647 1.0920 1.0986 1.1033 1.0562 1.0997 1.0995 1.0878 1.0881 1.0897 1.1059 1.0983 1.0996
irintensity: 0.9009 0.8110 0.6297 0.2146 2.5214 1.1643 0.2580 1.4127 0.5019 1.2770 0.7257 8.1446 2.5199 1.9223 1.0859 3.1077 2.2876 1.9469 1.0676 2.6928 2.9049 6.2417 0.2664 41.7974 0.7738 6.1478 3.4291 1.6042 3.7644 8.1144 6.3448 35.5237 43.4325 3.4750 0.4170 1.5155 3.7579 4.2192 0.1049 3.1273 5.3633 8.8489 1.0681 9.3746 2.3966 0.3616 10.8784 7.9369 3.9266 57.1005 1.3503 1.7692 7.2785 8.1136 2.3381 5.7841 0.7192 33.0924 27.0249 11.2375 32.4987 39.8420 26.9944 14.3648 3.7738 5.5266 2.4323 0.7621 32.4199 6.6675 8.4776 18.0054 5.1294 34.5222 5.3622 1.3260 12.5432 20.0549 11.1109 9.6659 51.1581 232.0957 26.5896 10.1488 0.2222 18.7208 9.2324 32.3929 50.6725 33.3890 26.5452 61.2180 54.2897 5.1894 53.4016 28.8357 2.9813 3.5327 8.2043 5.3166 4.5472 31.7437
temp: 298.150 k
press: 1.00000 atm
elementType: 35 8 6 6 6 6 6 6 6 6 6 6 6 6 6 6 6 6 6 1 1 1 1 1 1 1 1 1 1 1 1 1 1 1 1 1
symmnumber: 1
zpe: 765936.9 jmol-1
zpe.correction: 0.291730 hartree
zpe.thermalcorrener: 0.308640 hartree
zpe.thermalcorrenthalpy: 0.309584 hartree
zpe.thermalcorrgfe: 0.245855 hartree
zpe.sumelectzpe: -745.346066 hartree
zpe.sumelectthermal: -745.329156 hartree
zpe.sumelectthermalent: -745.328212 hartree
zpe.sumelectthermalfe: -745.391940 hartree
dipole: -4.7093 2.6061 1.9861
dipole: 5.7371
quadrupole: -116.3992 -117.7856 -123.7943
quadrupole: 6.6351 4.5420 -4.2102
quadrupole: 2.9272 1.5407 -4.4679 6.6351 4.5420 -4.2102
hfenergy: -745.6377956 hartree
pointgroup: C01 [X(C17H17Br1O1)]
dipole: 1.7607436 1.140706 -0.8325955 debye
polarizability: 289.5586514|-3.4719812|237.8180725|-5.676413|-10.389518|111.0513396 unknown
InChI: InChI=1S/C17H17BrO/c1-11-5-4-8-13-12-6-2-3-7-14(12)16(9-15(11)13)17(19)10-18/h2-3,6-7,9,11H,4-5,8,10H2,1H3
charge 0 multiplicity 1
36 atoms
Br -5.097234 -1.046227 0.049485
O  -2.247647 -2.809743 0.741364
C  2.745363 -1.726649 0.366483
C  3.997374 -0.864377 0.663121
C  1.490244 -0.86074 0.207761
C  1.536376 0.528744 -0.022423
C  4.084429 0.326406 -0.312259
C  2.86902 1.2622 -0.139877
C  0.297189 1.278693 -0.105727
C  2.954974 -2.640395 -0.875069
C  0.224322 -1.510692 0.282654
C  -0.987283 0.605511 -0.018087
C  -0.997595 -0.836218 0.133864
C  0.308336 2.708356 -0.24089
C  -2.181208 1.400497 -0.00508
C  -2.209117 -1.721624 0.095452
C  -0.874187 3.451327 -0.266793
C  -2.13069 2.790978 -0.134886
C  -3.337776 -1.410057 -0.897827
H  2.571223 -2.397525 1.233027
H  4.904893 -1.493827 0.594489
H  3.946695 -0.478359 1.701273
H  4.124848 -0.04709 -1.353615
H  5.015356 0.899414 -0.144758
H  2.833127 1.972963 -0.987682
H  3.011197 1.882547 0.77063
H  3.810759 -3.32087 -0.710795
H  2.061527 -3.259088 -1.074222
H  3.155895 -2.045018 -1.784129
H  0.188583 -2.59502 0.442925
H  1.264702 3.234762 -0.305324
H  -3.152283 0.923755 0.158082
H  -0.837023 4.541578 -0.366024
H  -3.057432 3.374544 -0.116186
H  -3.150952 -0.538376 -1.538707
H  -3.541108 -2.31388 -1.492547
