program: Gaussian 09
title: 000232820
version: EM64L-G09RevD.01
frameworkgroup: C1[X(C5H11NOS)]
method: RPBEPBE
basis: SDD
operation: Freq
keyword: #p
keyword: freq=noraman
keyword: PBEPBE/SDD
title: #p freq=noraman PBEPBE/SDD
converged: YES YES NO NO
title: Mulliken charges:
elementType: S O N C C C C C H H H H H H H H H H H
charge: -0.087086 -0.206999 -0.295850 -0.327592 -0.338639 -0.371935 -0.688554 -0.060207 0.181676 0.217907 0.204062 0.192203 0.250315 0.218230 0.219346 0.215362 0.209452 0.320430 0.147878
chargesum: 0.00000
title: Mulliken charges with hydrogens summed into heavy atoms:
elementType: S O N C C C C C
charge: 0.060792 -0.206999 0.024580 0.071991 0.057627 0.096609 -0.044393 -0.060207
polarizability: 1.11609092e+02 -4.48149725e+00 7.54087839e+01 -8.89637946e+00 -4.94000401e+00 5.86958166e+01
1716.lowfreq: -5.7759 -1.1804 -0.0024 0.0016 0.0024 5.8016 18.9647 54.2263 64.5715
frequency: 16.7516 54.1651 64.4827 100.6981 179.6464 211.2784 215.3130 237.9978 274.6597 395.5421 406.0463 452.9530 562.9862 624.9809 728.2393 746.7357 809.8976 833.1501 899.3556 936.3230 993.6998 1045.6756 1073.4288 1113.6493 1156.4620 1181.4325 1223.0670 1269.2300 1286.4654 1296.0882 1343.9447 1363.4507 1392.0103 1460.6839 1469.4844 1476.4243 1477.5722 1486.5371 1491.1369 1677.6298 2493.2735 2966.4297 2973.7134 2975.8906 2991.5339 3011.8545 3041.0029 3071.4460 3076.2832 3081.2560 3548.7814
redmass: 3.8944 4.6206 1.9737 2.2478 1.7631 1.6063 1.2011 2.6764 3.7947 8.5920 2.7529 3.8069 1.3479 6.6504 1.2933 1.6010 1.4912 1.2602 1.7615 1.2917 3.4127 3.7423 2.4614 2.3570 1.7952 2.7133 1.3592 1.3001 1.1077 1.1025 1.4345 1.4011 1.2128 1.0781 1.0784 1.0476 1.0714 1.2226 1.3371 8.7194 1.0383 1.0594 1.0611 1.0375 1.0671 1.0968 1.0995 1.1004 1.0994 1.1004 1.0778
irintensity: 2.6002 0.2324 0.3759 0.1781 29.0815 38.5235 4.8084 4.8232 11.6527 1.5494 3.5820 37.0000 110.5775 0.4561 15.8830 25.0841 39.9635 9.7679 4.2081 11.4381 8.3930 14.6516 1.0220 10.2768 9.5423 254.9630 21.9310 10.8731 5.9398 11.2107 2.1503 3.8274 9.7920 13.8252 1.8571 17.0967 14.3953 55.9329 157.0990 246.8519 4.2930 7.8860 40.7689 44.1074 48.8939 6.6722 26.4500 53.1359 50.5668 37.6646 26.0395
temp: 298.150 k
press: 1.00000 atm
elementType: 16 8 7 6 6 6 6 6 1 1 1 1 1 1 1 1 1 1 1
symmnumber: 1
zpe: 408289.9 jmol-1
zpe.correction: 0.155509 hartree
zpe.thermalcorrener: 0.166163 hartree
zpe.thermalcorrenthalpy: 0.167107 hartree
zpe.thermalcorrgfe: 0.117187 hartree
zpe.sumelectzpe: -724.518939 hartree
zpe.sumelectthermal: -724.508286 hartree
zpe.sumelectthermalent: -724.507341 hartree
zpe.sumelectthermalfe: -724.557261 hartree
dipole: -2.2709 -1.9515 1.0929
dipole: 3.1875
quadrupole: -55.9549 -60.8847 -57.0381
quadrupole: -0.7697 -1.9788 -0.7746
quadrupole: 2.0044 -2.9255 0.9211 -0.7697 -1.9788 -0.7746
hfenergy: -724.6744481 hartree
pointgroup: C01 [X(C5H11N1O1S1)]
dipole: 0.9214381 0.8106767 -0.2576797 debye
dipolederiv: -0.7572688 0.160307 -0.2686218 0.2355728 -0.0601035 -0.0059876 -0.3609775 -0.0299716 -0.3470677 -0.674958 0.0144694 -0.1326466 -0.0104711 -0.9217995 0.4122336 -0.1412383 0.3804012 -0.6017847 -1.4045701 -0.2477058 -0.0362737 -0.423707 -0.5494035 -0.0978249 -0.0194174 -0.1118116 -0.4084953 -0.1149993 0.0247338 -0.0182711 0.0578727 0.1604852 -0.0431481 -0.0457699 -0.0835544 0.0344084 0.0544615 0.022995 0.0255927 0.0397357 0.1706707 -0.0014682 0.1161804 0.0047647 0.0919369 0.62853 0.0251113 0.0677003 -0.1591976 0.1851433 0.0565585 0.1954611 0.1570252 0.2587265 -0.056142 0.0250201 0.0443159 0.0283914 0.086816 -0.0175631 -0.0058902 -0.0193438 0.0414734 1.9554218 0.1829009 0.5250408 0.4011305 1.1401503 -0.5094283 0.511568 -0.5082082 0.6831883 0.0396437 0.0061829 0.0137942 0.0065005 -0.0692919 0.1439921 0.0112348 0.1129084 -0.0642537 0.0370809 -0.0356697 -0.0273263 -0.0416014 -0.0739123 -0.1102191 -0.0222008 -0.0845599 -0.003662 0.0302637 -0.0270543 0.0426654 -0.0040522 -0.0470465 0.1401157 0.0091826 0.1182521 -0.0689291 0.0261126 -0.0142506 -0.0164013 -0.0436256 -0.1134775 -0.147932 -0.0344712 -0.1149745 -0.0200469 0.0881929 -0.0217081 0.0338083 0.0416928 0.0230452 0.1064461 -0.0009665 0.0426333 0.0229526 -0.0560153 -0.0538516 -0.0551512 -0.0341135 -0.076354 -0.1356176 -0.0533317 -0.1029396 0.0109771 -0.1922392 0.0433505 -0.0762015 0.0476759 0.0949863 0.0087369 -0.1021047 0.0158436 0.0311673 0.0738145 -0.0723971 -0.0309062 -0.0248701 -0.092803 -0.123542 0.0140785 -0.10945 0.0076025 0.0839046 0.0090115 0.0157592 -0.0341545 -0.0636863 0.1436168 0.0612574 0.1131834 -0.0441191 0.1571407 -0.015911 -0.0740739 -0.0048117 0.2195255 0.0892081 -0.1225106 0.1056666 0.2395474 0.0816259 -0.0255342 -0.0328034 -0.0779677 -0.0129446 0.091823 -0.010084 0.1141351 0.136378 unknown
polarizability: 111.0605231|3.0925827|70.799233|10.730364|-8.9953642|63.8539369 unknown
InChI: InChI=1S/C5H11NOS/c1-2-3-4-6-5(7)8/h6,8H,2-4H2,1H3
charge 0 multiplicity 1
19 atoms
S  -3.585709 0.388036 -0.833703
O  -2.027257 -1.245161 0.791764
N  -1.040569 0.743934 0.039668
C  1.393565 0.198511 -0.333106
C  2.760975 0.003807 0.361662
C  0.275267 0.538533 0.678023
C  3.892331 -0.324262 -0.636154
C  -2.058532 -0.172463 0.144013
H  1.477073 1.00864 -1.087123
H  1.115032 -0.721987 -0.881481
H  2.67768 -0.811316 1.108521
H  3.020898 0.921626 0.928059
H  0.153343 -0.2853 1.402096
H  0.541242 1.451148 1.247173
H  4.8574 -0.468077 -0.117193
H  3.668975 -1.250533 -1.197627
H  4.023058 0.491141 -1.372423
H  -1.176005 1.571627 -0.543873
H  -4.314067 -0.732703 -0.491597
