program: Gaussian 09
title: 000232808
version: EM64L-G09RevD.01
frameworkgroup: C1[X(C6H10N4O6)]
method: RPBEPBE
basis: SDD
operation: Freq
keyword: #p
keyword: freq=noraman
keyword: PBEPBE/SDD
title: #p freq=noraman PBEPBE/SDD
converged: YES YES NO NO
title: Mulliken charges:
elementType: O O O O O O N N N N C C C C C C H H H H H H H H H H
charge: -0.285414 -0.285408 -0.294301 -0.294303 -0.290872 -0.290879 -0.292038 -0.292039 -0.300004 -0.300003 0.142191 0.142191 0.321815 0.321817 -0.492731 -0.492731 0.389534 0.389536 0.371612 0.371612 0.238204 0.246140 0.245863 0.245879 0.238204 0.246125
chargesum: 0.00000
title: Mulliken charges with hydrogens summed into heavy atoms:
elementType: O O O O O O N N N N C C C C C C
charge: -0.285414 -0.285408 -0.294301 -0.294303 -0.290872 -0.290879 0.097497 0.097497 0.071609 0.071609 0.142191 0.142191 0.321815 0.321817 0.237475 0.237478
polarizability: 2.44323367e+02 -1.27738997e+01 1.11145735e+02 -1.10858608e-03 4.15570837e-04 5.84515181e+01
1716.lowfreq: -3.4783 -2.4450 0.0005 0.0007 0.0011 11.2542 20.3970 38.8315 56.1010
frequency: 20.3970 38.8315 56.1009 58.0174 77.5615 78.5293 87.4953 91.2251 101.0117 147.6051 148.1581 169.9563 198.7271 228.0443 228.1920 260.9896 285.6317 290.7965 303.6696 469.0319 477.7763 514.3316 567.8946 570.5492 581.5257 635.9653 649.3885 657.6928 657.9168 704.2612 707.9845 744.9255 772.2216 855.5341 920.5748 979.0127 1016.3698 1020.1844 1103.4954 1120.3142 1120.3171 1154.7292 1155.3717 1191.7808 1200.9849 1218.6639 1245.6629 1249.3297 1386.8132 1417.2893 1437.2032 1453.8948 1454.4154 1454.4304 1468.4798 1468.7413 1523.0903 1542.7602 1586.1288 1602.5063 1653.0215 1668.5925 3007.4990 3007.6017 3110.5670 3110.5815 3153.7385 3153.7443 3483.2994 3483.4113 3535.5937 3535.6100
redmass: 5.5316 5.7931 4.0034 4.4452 1.4977 1.3614 5.1321 6.3293 3.6041 3.6365 3.3230 5.7896 7.8242 5.7400 7.9226 7.3437 6.1056 9.1616 5.5613 5.3482 8.7661 5.9312 1.1227 5.3961 1.2407 6.8295 6.3417 2.2639 2.2505 1.7703 1.6752 9.1041 7.4228 8.7550 8.5436 6.9096 4.6647 4.6265 4.3048 1.2500 1.2500 1.4512 1.4559 4.8180 2.0587 1.7148 2.2467 2.2435 2.0089 1.4436 1.2984 1.9956 1.0492 1.0622 1.0604 1.0874 2.6045 2.2592 10.9484 7.2275 10.1460 11.2398 1.0297 1.0297 1.1052 1.1052 1.1047 1.1047 1.0810 1.0802 1.0791 1.0791
irintensity: 0.5849 1.3772 0.0000 5.5181 3.2793 0.0007 0.0001 0.0000 2.9750 29.8685 0.0005 12.8905 0.0000 0.0411 0.5833 70.2879 74.0722 0.0082 0.0000 35.8393 0.0000 2.9868 0.0001 0.0009 274.4928 9.6600 0.0000 0.0035 63.3289 0.0004 259.7058 0.0000 41.3691 0.0000 80.6466 0.0002 71.4085 0.0000 188.5357 0.1653 0.3057 145.4688 0.0026 0.0003 285.2705 0.0000 367.8066 0.0013 1086.9224 0.0010 395.9770 0.7739 0.1330 28.4081 14.1850 0.0005 0.0000 296.7597 730.3905 0.0002 363.7766 0.0002 89.4413 0.0133 3.7092 48.0934 26.9186 2.0491 186.4142 0.3258 45.1810 170.6958
temp: 298.150 k
press: 1.00000 atm
elementType: 8 8 8 8 8 8 7 7 7 7 6 6 6 6 6 6 1 1 1 1 1 1 1 1 1 1
symmnumber: 1
zpe: 489474.5 jmol-1
zpe.correction: 0.186431 hartree
zpe.thermalcorrener: 0.204368 hartree
zpe.thermalcorrenthalpy: 0.205312 hartree
zpe.thermalcorrgfe: 0.137702 hartree
zpe.sumelectzpe: -903.738788 hartree
zpe.sumelectthermal: -903.720851 hartree
zpe.sumelectthermalent: -903.719906 hartree
zpe.sumelectthermalfe: -903.787517 hartree
dipole: 0.0002 0.0000 0.0023
dipole: 0.0023
quadrupole: -47.2626 -107.7144 -91.8646
quadrupole: 11.5004 -0.0019 0.0001
quadrupole: 35.0179 -25.4338 -9.5841 11.5004 -0.0019 0.0001
hfenergy: -903.9252187 hartree
pointgroup: C01[X(C6H10N4O6)]
dipole: 0.0000962 0.0008905 -0.0000011 debye
dipolederiv: -1.9664142 0.0001599 0.0524759 -0.0024789 -0.318618 0.0000214 0.5978564 0.0002636 -0.5274278 -1.966457 -0.0009477 0.0524456 -0.0010998 -0.3186163 0.0008134 0.5978379 0.0007924 -0.5274094 -0.7274724 -0.0001665 0.0738017 0.0009832 -0.3603547 0.0010781 -0.4358972 0.0012631 -0.9395821 -0.7274839 -0.0001294 0.0738 0.0012535 -0.3603574 0.0015761 -0.4359099 0.0015796 -0.939589 -0.7681417 0.000028 -0.0134989 -0.0000695 -0.3553268 0.0006918 -0.3839857 0.0004865 -1.0505804 -0.7681359 -0.0001056 -0.013483 0.0010925 -0.3553351 0.0018708 -0.3839782 0.0020642 -1.0505725 -0.2875917 0.0001579 -0.3264953 0.0013394 -0.2321846 0.0006656 -0.6783116 0.0006492 -0.5184073 -0.2875917 0.000825 -0.3264961 0.0020589 -0.2321861 0.0008849 -0.6783356 0.0007947 -0.5184063 -1.6602381 0.0005595 -0.378828 -0.0002468 -0.3211631 -0.0004219 -0.5419431 -0.0002194 -0.4256414 -1.6602381 0.000883 -0.3788328 0.0011852 -0.3211634 0.0001977 -0.5419392 0.0001664 -0.4256581 1.0997426 -0.0006412 0.3277571 -0.0017454 0.1940263 -0.0018209 0.7669648 -0.0018292 1.0700895 1.0997466 -0.0010749 0.3277539 -0.0025278 0.1940304 -0.002466 0.7669687 -0.0024748 1.0700929 2.8683158 0.0004384 0.2363032 0.0010755 0.3465317 -0.0006775 0.4492229 -0.0007698 1.5400529 2.8683207 -0.0001114 0.2363114 -0.0007757 0.3465406 -0.0035193 0.4492336 -0.0036859 1.540032 0.9318749 -0.000957 0.0636955 0.0000673 0.2830575 -0.0005413 0.2192408 -0.0003689 0.2364329 0.931873 0.0008773 0.0637138 -0.0004081 0.2830522 0.0007621 0.2192556 0.000602 0.2364468 0.3645277 0.0001105 -0.0223654 0.000164 0.361693 0.0000627 0.0886123 0.0000881 0.2918856 0.3645397 0.0001074 -0.0223653 -0.0002532 0.3616912 0.000204 0.088638 0.0001806 0.2918884 0.2129267 0.0000168 -0.0726076 -0.0000155 0.3847918 0.0003504 0.0215375 0.0002329 0.2583135 0.2129272 0.0002144 -0.07261 -0.0000221 0.3847934 0.0003882 0.0215338 0.0003798 0.2583159 -0.0466117 -0.0007355 0.0683397 -0.001168 0.1273628 0.0014315 0.1300505 0.0015903 -0.0133529 -0.0095983 0.0159062 -0.0038818 -0.0374132 -0.0531677 -0.0899242 -0.1166277 -0.0988581 0.0378907 -0.0113097 -0.014877 -0.004695 0.0396974 -0.0566506 0.0890959 -0.1167218 0.09756 0.0403253 -0.0112168 0.0149464 -0.0045711 -0.0391574 -0.0558325 -0.0894896 -0.1168211 -0.0980056 0.0395374 -0.0466158 0.0003668 0.0683414 0.0005221 0.1273736 -0.0007833 0.1300557 -0.0009069 -0.0133571 -0.009678 -0.0158513 -0.004009 0.0379424 -0.0539882 0.0895494 -0.1165373 0.0984251 0.0386808 unknown
polarizability: 243.0040946|-0.0364582|58.4517585|18.361053|-0.113937|112.4647674 unknown
InChI: InChI=1S/C6H10N4O6/c1-15-5(13)9-7-3(11)4(12)8-10-6(14)16-2/h7-10H,1-2H3
charge 0 multiplicity 1
26 atoms
O  -5.250388 -0.427709 0.503578
O  5.250216 -0.425292 -0.504322
O  -0.580442 -0.4297 1.720041
O  0.580263 -0.421885 -1.720834
O  -4.194102 -0.425052 -1.618213
O  4.193863 -0.431379 1.617423
N  -1.771036 -0.425285 -0.284428
N  1.770872 -0.427606 0.283625
N  -2.993484 -0.425893 0.381325
N  2.99331 -0.425988 -0.38213
C  -0.61505 -0.427103 0.442878
C  0.614878 -0.425308 -0.443674
C  -4.15735 -0.426261 -0.359635
C  4.15716 -0.427995 0.358847
C  -6.570021 -0.426392 -0.169228
C  6.569828 -0.426047 0.168528
H  -1.79309 -0.42354 -1.312431
H  1.792948 -0.430708 1.311625
H  -2.941978 -0.427422 1.40373
H  2.941806 -0.423096 -1.404531
H  -7.298433 -0.434785 0.653065
H  -6.676874 -1.321871 -0.80371
H  -6.681949 0.478365 -0.78957
H  6.681194 0.47611 0.792742
H  7.29827 -0.430482 -0.65377
H  6.67719 -1.324177 0.799167
