program: Gaussian 09
title: 000232803
version: EM64L-G09RevD.01
frameworkgroup: C1[X(C9H6Cl2N2O2)]
method: RPBEPBE
basis: SDD
operation: Freq
keyword: #p
keyword: freq=noraman
keyword: PBEPBE/SDD
title: #p freq=noraman PBEPBE/SDD
converged: NO YES NO NO
title: Mulliken charges:
elementType: Cl Cl O O N N C C C C C C C C C H H H H H H
charge: -0.043166 -0.027742 -0.208699 -0.221660 -0.379581 -0.397493 -0.306413 0.603919 0.145064 0.188922 -0.287360 -0.353913 -0.215562 -0.223834 -0.100340 0.298200 0.352312 0.357057 0.268276 0.286505 0.265506
chargesum: 0.00000
title: Mulliken charges with hydrogens summed into heavy atoms:
elementType: Cl Cl O O N N C C C C C C C C C
charge: -0.043166 -0.027742 -0.208699 -0.221660 -0.027269 -0.040436 -0.008213 0.603919 0.145064 0.188922 -0.287360 -0.085637 0.070943 0.041672 -0.100340
polarizability: 1.82143758e+02 -7.24070099e+00 1.32930152e+02 -3.31477755e+00 1.84505307e+00 7.99344641e+01
1716.lowfreq: -3.0086 -2.0383 -0.0017 0.0006 0.0022 3.4119 30.7590 43.8688 93.0269
frequency: 30.6321 43.8029 93.0198 121.0352 159.8193 164.6938 169.9453 210.7254 225.5945 311.1923 368.2585 368.8840 411.9994 436.9335 457.9821 505.1567 540.6425 545.3181 601.7232 611.7158 654.2307 663.9441 687.7447 709.9757 726.9886 751.8815 810.6961 849.4284 865.4411 913.1705 955.4709 961.4761 1020.2508 1066.1743 1087.4892 1146.1214 1169.8067 1200.0115 1231.9335 1269.5595 1283.8073 1311.1827 1328.1784 1353.1174 1372.1379 1380.8515 1460.9538 1568.0208 1594.6729 1682.4974 1729.6286 2978.8693 3164.0324 3182.5475 3185.9642 3589.7152 3600.7191
redmass: 10.5810 8.7070 7.0264 10.2779 7.9704 6.7589 19.9310 10.7145 11.0314 7.6397 8.4382 12.8969 5.2710 4.6372 5.3498 1.4170 2.4499 4.8444 11.7465 3.6621 5.5874 1.4581 5.4906 6.4207 5.1432 6.5898 2.0075 2.6010 1.4081 4.9277 2.5057 1.5681 3.9003 2.6675 2.5407 1.4914 2.2802 2.1269 2.5419 1.5560 1.3905 1.6459 3.8532 2.2856 3.0540 3.7876 2.5700 7.7575 7.2411 8.6906 9.6275 1.0818 1.0890 1.0963 1.0946 1.0802 1.0807
irintensity: 0.9418 0.7029 0.1277 1.9771 2.1912 1.1845 0.3308 0.3979 1.6681 3.3038 8.9360 21.3051 9.2881 3.3667 12.2820 46.0950 69.9210 12.3318 17.0003 10.9195 12.3138 96.8452 20.7398 7.5759 68.9156 68.3618 36.1129 21.1777 20.9877 7.7512 18.8351 4.8011 30.1327 24.1923 29.0798 8.9737 79.2544 12.5301 111.2542 17.8231 34.5573 24.4944 138.4056 10.1847 16.0903 13.8190 96.0433 27.3092 60.3087 524.6407 456.3277 8.6593 0.0757 0.6366 1.2882 91.0267 49.2618
temp: 298.150 k
press: 1.00000 atm
elementType: 17 17 8 8 7 7 6 6 6 6 6 6 6 6 6 1 1 1 1 1 1
symmnumber: 1
zpe: 364189.7 jmol-1
zpe.correction: 0.138713 hartree
zpe.thermalcorrener: 0.151743 hartree
zpe.thermalcorrenthalpy: 0.152687 hartree
zpe.thermalcorrgfe: 0.097293 hartree
zpe.sumelectzpe: -1525.602078 hartree
zpe.sumelectthermal: -1525.589048 hartree
zpe.sumelectthermalent: -1525.588104 hartree
zpe.sumelectthermalfe: -1525.643498 hartree
dipole: 1.2885 0.1901 -0.4388
dipole: 1.3743
quadrupole: -110.0130 -96.3789 -109.8572
quadrupole: 3.5487 6.7529 -6.8861
quadrupole: -4.5967 9.0375 -4.4409 3.5487 6.7529 -6.8861
hfenergy: -1525.7407908 hartree
pointgroup: C01 [X(C9H6Cl2N2O2)]
dipole: 0.5210305 0.1289001 -0.065396 debye
dipolederiv: -0.2246109 0.1343791 0.0814997 0.1341506 -0.4733707 -0.2869181 0.0983016 -0.3188477 -0.2924384 -0.8049929 0.2388825 0.0030361 0.2418159 -0.1684364 -0.0354767 -0.0291614 -0.0251854 -0.0794462 -0.5824771 -0.0627025 0.0597085 -0.0361808 -0.3430796 -0.015298 0.1208424 0.0802681 -1.1222517 -1.0503954 -0.2058146 0.3355271 -0.3371178 -0.4495939 0.134791 0.5331393 0.1615043 -0.8463024 -1.316777 -0.1614126 -0.0322022 -0.2605725 -0.5449172 0.0275219 -0.0183842 0.0220286 -0.4113281 -0.780154 -0.106175 0.4861528 -0.2042257 -0.3893098 0.1719604 0.2513774 0.0932166 -1.2383742 0.3908195 -0.1040956 -0.1857415 -0.2283481 0.246248 -0.2135175 -0.4411949 -0.2005279 0.1553315 0.0513576 0.0449881 0.0655739 -0.0393062 -0.2147539 -0.1342564 -0.0542362 -0.1070956 -0.1860041 1.1047617 0.3237672 -0.4685313 0.4674429 0.3441503 -0.1339421 -0.1985124 -0.123401 1.4113485 1.704931 0.4963886 -0.2740511 0.7483907 0.5532387 -0.0209189 -0.4195939 -0.1045021 1.6935374 0.2795332 -0.2568145 -0.113264 -0.1386384 0.6397081 0.5246134 -0.0349375 0.541418 0.3564572 0.0118324 -0.064669 0.0013623 -0.0826093 0.0132595 0.0436058 0.0286113 0.0800651 -0.0175057 -0.3940208 0.186282 0.0724359 0.2072584 -0.258157 -0.1093434 0.0719724 -0.122024 -0.130057 -0.3946511 0.0360998 -0.0490079 0.0542571 -0.0439863 0.0635368 -0.0695599 0.0668256 -0.05342 1.2089564 -0.368604 0.0471126 -0.41005 0.2240555 0.1250709 0.0516011 0.1284697 0.0639134 -0.0076017 -0.0034479 0.0151097 0.021092 -0.0305106 0.0647551 0.0923481 0.0120613 0.046329 0.3042236 -0.082289 0.0055154 -0.0682819 0.2980596 -0.0258881 0.0208321 0.0093679 0.1909145 0.2761657 -0.0507141 0.0253462 -0.0572851 0.3308777 -0.0127925 0.0645986 0.001357 0.1677049 0.0762418 -0.0253941 -0.0478416 -0.0479404 0.0904022 -0.0368898 -0.0359281 -0.0584063 0.0819475 0.0693597 -0.01212 -0.0393176 -0.0111069 0.1170062 -0.0510873 -0.04317 -0.0533344 0.1119399 0.0774983 0.0434655 0.011577 0.0472558 0.0591097 -0.0795266 0.0110542 -0.0832578 0.0977038 unknown
polarizability: 180.7270215|-9.6678121|101.9857109|-6.2593729|26.7487064|112.2956423 unknown
InChI: InChI=1S/C9H6Cl2N2O2/c10-4-1-2-5(6(11)3-4)7-8(14)13-9(15)12-7/h1-3,7,12-13H
charge 0 multiplicity 1
21 atoms
Cl 0.872799 2.217043 1.805511
Cl 4.785093 -1.282824 0.029072
O  -1.790581 0.024321 -2.395056
O  -3.847851 -0.656231 1.796306
N  -1.802544 0.394123 1.165722
N  -3.075453 -0.468308 -0.46375
C  -1.067683 0.698379 -0.079156
C  0.375911 0.192154 -0.086246
C  -1.986959 0.056771 -1.158088
C  -2.997606 -0.279711 0.960287
C  1.35075 0.803576 0.738243
C  0.805418 -0.893502 -0.889732
C  2.690395 0.380043 0.796092
C  2.139652 -1.352347 -0.86178
C  3.062921 -0.707945 -0.017528
H  -1.05661 1.793135 -0.258217
H  -1.505485 0.712156 2.086796
H  -3.86654 -0.941179 -0.901601
H  0.094527 -1.373533 -1.56802
H  3.413123 0.877329 1.446864
H  2.453621 -2.189751 -1.490221
