program: Gaussian 09
title: 000232872
version: EM64L-G09RevD.01
frameworkgroup: C1[X(C21H25NO5)]
method: RPBEPBE
basis: SDD
operation: Freq
keyword: #p
keyword: freq=noraman
keyword: PBEPBE/SDD
title: #p freq=noraman PBEPBE/SDD
converged: YES YES NO NO
title: Mulliken charges:
elementType: O O O O O N C C C C C C C C C C C C C C C C C C C C C H H H H H H H H H H H H H H H H H H H H H H H H H
charge: -0.255935 -0.254206 -0.272579 -0.437949 -0.208319 -0.394173 -0.561356 -0.208733 -0.020767 0.266266 0.487479 0.520205 0.191926 -0.423255 -0.342199 -0.377962 -0.443330 -0.202219 -0.239393 -0.228330 -0.236674 -0.239226 -0.228529 -0.243921 -0.249277 -0.681324 -0.685586 0.191246 0.317286 0.219392 0.320618 0.219169 0.256365 0.286541 0.219766 0.191413 0.212927 0.230085 0.226900 0.222850 0.226021 0.224679 0.224339 0.227159 0.228457 0.227160 0.249053 0.200982 0.219509 0.230008 0.208014 0.389429
chargesum: 0.00000
title: Mulliken charges with hydrogens summed into heavy atoms:
elementType: O O O O O N C C C C C C C C C C C C C C C C C C C C C
charge: -0.255935 -0.254206 -0.272579 -0.048519 -0.208319 -0.073556 -0.370109 0.108553 0.198624 0.266266 0.487479 0.520205 0.191926 -0.204086 -0.085835 -0.091421 -0.223564 0.202120 0.217592 -0.005480 -0.010654 -0.014547 -0.004190 -0.016762 -0.020820 -0.004129 -0.028055
polarizability: 2.54352823e+02 7.62913629e+00 2.56949468e+02 -2.72327829e+00 7.21687299e+00 2.23599291e+02
1716.lowfreq: -9.0423 -4.9741 -1.3576 0.0004 0.0005 0.0005 4.4637 12.3332 20.5419
frequency: -8.1904 11.7617 20.3140 27.0593 32.4128 39.4466 45.1667 52.5604 56.4443 64.0051 71.4592 88.0712 107.6710 115.7435 124.8534 149.6793 185.8129 194.2010 202.7835 226.5075 242.3704 245.5450 255.1261 268.6229 276.5441 285.8667 316.8901 333.5107 353.5948 400.5833 403.5351 405.1680 458.6047 475.4243 494.6912 524.3201 545.3779 569.1124 590.9103 598.8668 614.8733 615.2678 630.0215 657.2581 695.0008 704.3626 708.1261 714.4586 733.5395 754.7676 775.8275 790.1566 811.0265 820.8427 824.1271 836.7881 843.9894 857.1447 859.0937 873.7625 911.7018 928.4444 951.4715 968.3353 975.2449 982.4480 989.3777 990.9957 991.7757 1000.9081 1003.9128 1024.7067 1027.0843 1029.5618 1043.5917 1053.2558 1077.3491 1086.7359 1090.4987 1099.2808 1111.8375 1122.8716 1137.0283 1141.7680 1169.4319 1171.2269 1175.3150 1187.6193 1192.4425 1193.8047 1199.5893 1233.9954 1248.7264 1255.6600 1258.3896 1284.0060 1287.7333 1307.6716 1317.9223 1333.6793 1335.0856 1350.7297 1366.6762 1373.4672 1383.0732 1384.8094 1394.9308 1399.6857 1439.9118 1441.9480 1460.2554 1460.6123 1474.3732 1477.7595 1478.1784 1481.8998 1484.5360 1491.2071 1496.7590 1590.9131 1592.4790 1606.2279 1611.5807 1620.3798 1682.5700 2948.9283 2979.9252 2983.1411 2991.8278 2993.6015 2994.4780 3014.6518 3045.3132 3074.7251 3089.1462 3090.9112 3099.9811 3102.4345 3109.8784 3111.3509 3125.4282 3126.5665 3138.4133 3139.6051 3154.2245 3155.9226 3164.7536 3168.3598 3527.4313 3556.4760
redmass: 3.8621 5.1425 4.7972 4.2386 4.1013 5.2224 2.6956 3.1120 2.5801 7.6765 4.5760 4.0780 4.3770 2.9590 5.6155 3.9479 3.6408 3.3213 4.7690 2.8986 1.3926 4.0919 1.4967 4.5856 4.8017 6.1278 5.8848 4.8974 4.1998 2.7882 3.8513 2.9389 4.2871 3.4997 3.4327 4.3105 3.9160 1.5784 2.7408 1.4602 6.3575 6.2764 4.2816 4.5841 2.7077 2.6965 1.8881 5.0166 3.6951 1.8709 2.8213 3.0485 1.1486 1.3565 2.3832 3.3385 1.2557 2.3924 1.6127 3.2879 1.6397 1.6257 3.3878 1.4054 6.5104 1.3980 5.2667 3.8276 1.5297 2.6748 1.3343 2.9491 2.2572 2.2639 3.8892 4.8842 1.6290 2.0585 2.0382 2.8848 2.1891 2.1785 1.4494 1.5024 1.3610 1.0847 1.4812 1.1949 1.9869 1.1233 2.3657 1.5629 1.1516 1.3060 1.1634 1.4427 1.9195 1.6059 1.1975 1.2607 1.2487 1.4480 1.2581 1.3178 6.3724 6.5409 1.2599 1.2716 2.1290 2.1806 1.0407 1.0401 1.8108 1.9988 1.1324 1.1015 1.9296 1.0792 1.0935 6.1179 6.2144 6.0404 5.8885 6.3547 9.2080 1.0592 1.0846 1.0555 1.0368 1.0363 1.0837 1.1034 1.1071 1.0846 1.0988 1.0989 1.1018 1.1014 1.0874 1.0872 1.0866 1.0867 1.0927 1.0925 1.0957 1.0964 1.1001 1.0989 1.0643 1.0777
irintensity: 0.1165 0.2280 0.3306 0.0626 0.0376 2.1953 0.0364 0.2691 0.9847 1.3931 0.8205 1.5274 2.6237 0.9211 7.2598 4.4302 1.0752 8.1262 6.0006 0.1806 0.3878 0.6390 3.3706 3.4526 1.5216 1.7397 4.8259 1.8177 14.0656 0.2680 3.9486 0.6568 4.0859 3.0777 1.2446 21.0648 39.5377 12.1258 111.1817 225.7569 2.9208 0.5295 8.6609 8.0354 21.1125 33.1800 54.3491 13.4267 32.2071 33.9282 5.6934 3.7876 4.7852 10.3755 10.1026 9.2024 0.2263 2.3953 0.4096 42.3288 4.8615 7.5245 57.8493 0.9610 178.4893 0.0757 0.1244 1.1292 0.8003 12.8905 2.0097 86.7487 5.3905 17.0698 34.8090 170.9081 1.3489 110.9895 21.4274 53.9616 0.9238 35.8732 8.6510 6.4244 12.7621 0.7694 29.2784 1.0693 9.1107 1.4789 68.5433 7.7677 1.1349 2.3473 5.9857 49.3160 28.4960 59.2380 26.7340 3.6304 10.6808 25.4922 2.3548 0.7585 0.3916 2.0213 25.2867 17.1914 1.1808 18.4256 8.8828 10.5355 245.0790 50.0052 12.7060 4.9962 30.7325 13.0416 9.6396 5.7556 6.4553 19.0355 6.0135 93.6557 245.4822 45.1496 44.9859 20.2793 27.1300 17.2084 25.3515 38.1099 9.6534 14.9548 29.3408 31.1552 36.7695 32.3803 9.1478 10.2314 1.5607 1.1156 21.4044 38.7842 20.2490 21.5041 30.5398 10.4212 33.5795 27.7691
temp: 298.150 k
press: 1.00000 atm
elementType: 8 8 8 8 8 7 6 6 6 6 6 6 6 6 6 6 6 6 6 6 6 6 6 6 6 6 6 1 1 1 1 1 1 1 1 1 1 1 1 1 1 1 1 1 1 1 1 1 1 1 1 1
symmnumber: 1
zpe: 1102394.5 jmol-1
zpe.correction: 0.419880 hartree
zpe.thermalcorrener: 0.446594 hartree
zpe.thermalcorrenthalpy: 0.447538 hartree
zpe.thermalcorrgfe: 0.358496 hartree
zpe.sumelectzpe: -1244.100254 hartree
zpe.sumelectthermal: -1244.073540 hartree
zpe.sumelectthermalent: -1244.072596 hartree
zpe.sumelectthermalfe: -1244.161638 hartree
dipole: 0.3880 1.6562 3.6255
dipole: 4.0048
quadrupole: -157.6040 -151.2618 -146.3303
quadrupole: 7.3476 -0.7465 -6.0492
quadrupole: -5.8720 0.4703 5.4017 7.3476 -0.7465 -6.0492
hfenergy: -1244.5201336 hartree
pointgroup: C01 [X(C21H25N1O5)]
dipole: 0.2029167 -1.4389774 0.6088338 debye
polarizability: 253.9064068|7.736217|250.8285433|-0.1845114|15.3390167|230.1666318 unknown
InChI: InChI=1S/C21H25NO5/c1-3-26-21(27-4-2)18(20(24)25)22-19(23)17(15-11-7-5-8-12-15)16-13-9-6-10-14-16/h5-14,17-18,21-22,24H,3-4H2,1-2H3
charge 0 multiplicity 1
52 atoms
O  -2.507917 -1.155976 -0.406399
O  -4.21606 -0.704866 1.255816
O  -0.207129 1.4566 -0.686504
O  -1.780583 0.182337 3.677713
O  -3.121497 1.925221 2.916263
N  -0.53393 0.17396 1.223264
C  1.704059 0.138133 0.190391
C  -1.970909 0.435552 1.292669
C  -2.796391 -0.855782 0.973228
C  0.251654 0.667018 0.190783
C  2.762883 1.255802 0.195911
C  1.882542 -0.839778 -0.988329
C  -2.372877 0.962508 2.668658
C  3.964303 1.034425 0.917819
C  1.712125 -0.414873 -2.330456
C  2.608626 2.472822 -0.516136
C  2.224806 -2.19093 -0.733799
C  -2.855868 -2.538952 -0.812338
C  -4.919332 0.340826 0.456074
C  4.993071 2.001767 0.929976
C  1.882396 -1.328058 -3.393281
C  3.636397 3.442972 -0.498916
C  2.399536 -3.105385 -1.798168
C  4.83215 3.213351 0.219112
C  2.228491 -2.675544 -3.133486
C  -2.385647 -2.714109 -2.254544
C  -6.414892 0.0612 0.588251
H  1.85502 -0.451002 1.115882
H  -2.199228 1.202835 0.53354
H  -2.493979 -1.684994 1.647382
H  -0.126839 -0.424047 1.944387
H  4.099428 0.094866 1.469154
H  1.427856 0.621883 -2.53547
H  1.677642 2.660298 -1.059743
H  2.361607 -2.531023 0.300953
H  -2.34477 -3.252844 -0.13097
H  -3.949959 -2.68491 -0.713227
H  -4.664764 1.338587 0.862963
H  -4.579838 0.275618 -0.595202
H  5.91399 1.811989 1.493086
H  1.745432 -0.988454 -4.426203
H  3.500644 4.381413 -1.048674
H  2.66964 -4.146052 -1.585324
H  5.626737 3.967979 0.227174
H  2.36491 -3.380301 -3.961512
H  -2.888554 -1.987991 -2.916221
H  -1.296508 -2.553389 -2.33138
H  -2.619417 -3.734183 -2.610884
H  -6.6656 -0.933669 0.180711
H  -6.723299 0.090354 1.647557
H  -6.994587 0.823658 0.036141
H  -2.065968 0.514133 4.571011
