program: Gaussian 09
title: 000232792
version: EM64L-G09RevD.01
frameworkgroup: C1[X(C13H14FNO4)]
method: RPBEPBE
basis: SDD
operation: Freq
keyword: #p
keyword: freq=noraman
keyword: PBEPBE/SDD
title: #p freq=noraman PBEPBE/SDD
converged: YES YES NO NO
title: Mulliken charges:
elementType: F O O O O N C C C C C C C C C C C C C H H H H H H H H H H H H H H
charge: -0.199943 -0.388359 -0.221959 -0.243739 -0.305714 -0.377387 -0.403303 -0.111973 -0.534243 0.101009 0.138762 0.321005 0.254171 -0.332370 -0.354022 -0.786622 -0.367904 -0.389269 0.330323 0.273204 0.214621 0.288987 0.243359 0.272289 0.339582 0.275861 0.309369 0.263239 0.238731 0.240510 0.259266 0.261585 0.390934
chargesum: 0.00000
title: Mulliken charges with hydrogens summed into heavy atoms:
elementType: F O O O O N C C C C C C C C C C C C C
charge: -0.199943 0.002575 -0.221959 -0.243739 -0.305714 -0.037805 0.084522 0.177014 -0.018596 0.101009 0.138762 0.321005 0.254171 -0.056509 -0.044653 -0.044143 -0.108638 -0.127684 0.330323
polarizability: 2.12595342e+02 8.59210976e+00 1.70090842e+02 -1.64330132e+01 -1.21064265e+00 9.57755244e+01
1716.lowfreq: -82.4623 -3.8488 -0.0011 -0.0010 -0.0010 0.6918 5.2198 15.0990 32.0999
frequency: -82.4595 14.2077 32.0219 50.2749 53.6523 73.0509 87.1670 91.7764 99.9982 134.0672 154.8608 202.7591 238.8977 257.8062 274.2587 313.1757 336.1048 358.5010 377.1322 394.0001 413.9583 466.5539 488.9434 499.8693 553.7468 572.5988 584.3994 600.2987 605.0060 614.0410 624.9319 641.7450 693.5589 704.8474 742.2680 798.7546 826.9686 834.8300 855.2994 874.5977 938.0996 952.9928 973.3847 976.4476 983.0772 992.5254 1004.9516 1027.8215 1036.8968 1064.7432 1091.3978 1109.8282 1123.8020 1158.1626 1182.8066 1209.9054 1214.1771 1232.9741 1245.3993 1270.4391 1304.7198 1309.8996 1337.1472 1349.8665 1358.5160 1378.3130 1380.5351 1410.3817 1439.8089 1447.3660 1459.2174 1467.3788 1493.5554 1497.9159 1566.0987 1596.2209 1607.2881 1612.9288 1645.6370 2980.2973 2993.5793 3007.2011 3030.2939 3071.2255 3079.8098 3100.7236 3136.6925 3150.1023 3156.2549 3175.9452 3178.8527 3492.0034 3516.0963
redmass: 1.0444 9.1519 5.0658 8.2126 6.2491 5.6279 6.5539 5.9048 5.7663 6.8492 5.2822 3.6629 2.9780 5.3755 8.0283 5.3293 4.3900 4.4330 6.1081 2.6918 2.9586 4.7183 3.3347 3.1070 3.0711 2.2062 3.3774 3.2132 2.8014 2.6781 6.9432 1.2630 3.4944 3.6830 3.3993 6.1034 1.3365 1.8416 2.1303 3.6349 2.6839 2.9719 1.4310 2.9270 1.3974 1.8449 2.6936 2.7727 1.6882 2.4324 3.0936 1.3697 2.5244 1.5796 1.2706 1.8401 1.2526 1.5828 2.1934 1.9151 1.3350 1.3399 1.3773 2.4169 1.6212 4.4190 1.2933 3.6123 1.1157 1.1439 1.0884 1.0490 2.3755 1.8711 8.2230 6.8080 6.5315 6.4836 7.9626 1.0684 1.0380 1.0613 1.0833 1.1031 1.0982 1.0908 1.0987 1.0915 1.0888 1.0957 1.0973 1.0773 1.0643
irintensity: 0.0740 0.9609 0.4289 1.0417 0.6629 0.8814 14.0865 2.1981 1.5257 8.7478 7.9269 1.6083 3.9557 2.5581 1.5402 2.9036 4.5229 4.5814 4.3765 11.5189 0.4715 7.0983 10.1315 42.1092 38.5306 38.3584 18.7717 28.5448 25.3223 43.2419 1.1610 69.0480 67.3558 15.3941 15.2531 21.0596 8.3032 34.0593 46.6485 3.7817 19.5915 29.0642 8.5656 24.7865 0.8567 19.2592 5.0150 6.5308 9.4684 198.1818 4.5434 6.7348 8.4889 76.3879 9.8268 19.2358 0.6773 65.5880 135.8074 24.5460 25.8666 50.5265 4.8401 108.6675 18.9053 23.9299 54.4295 21.8101 36.6315 93.7638 33.3830 20.5332 72.7389 129.9998 129.0424 53.3264 209.3933 211.6788 140.6141 17.4847 7.9828 28.7120 7.2112 7.2658 13.0390 2.5504 7.0731 36.7534 0.2423 2.3677 14.1896 67.4443 33.4322
temp: 298.150 k
press: 1.00000 atm
elementType: 9 8 8 8 8 7 6 6 6 6 6 6 6 6 6 6 6 6 6 1 1 1 1 1 1 1 1 1 1 1 1 1 1
symmnumber: 1
zpe: 658320.7 jmol-1
zpe.correction: 0.250741 hartree
zpe.thermalcorrener: 0.268766 hartree
zpe.thermalcorrenthalpy: 0.269710 hartree
zpe.thermalcorrgfe: 0.201888 hartree
zpe.sumelectzpe: -957.897736 hartree
zpe.sumelectthermal: -957.879712 hartree
zpe.sumelectthermalent: -957.878767 hartree
zpe.sumelectthermalfe: -957.946589 hartree
dipole: -3.8311 0.9462 1.3151
dipole: 4.1596
quadrupole: -111.6706 -106.9786 -107.1833
quadrupole: -5.6145 2.3687 4.8409
quadrupole: -3.0598 1.6322 1.4275 -5.6145 2.3687 4.8409
hfenergy: -958.1484772 hartree
pointgroup: C01 [X(C13H14F1N1O4)]
dipole: 1.3904333 -0.6704991 0.5434239 debye
polarizability: 211.9531273|-0.8691571|168.1861617|23.1427955|4.505144|98.3224189 unknown
InChI: InChI=1S/C13H14FNO4/c1-8(16)15-11(13(18)19)6-7-12(17)9-2-4-10(14)5-3-9/h2-5,11,15,18H,6-7H2,1H3
charge 0 multiplicity 1
33 atoms
F  -5.698967 0.075003 -1.042725
O  3.558347 1.8522 -0.953639
O  -0.170818 2.746078 0.777446
O  4.820183 0.01963 -0.286537
O  0.445351 -2.120912 -0.325504
N  2.586899 -1.433445 0.269294
C  1.87531 0.769347 1.323349
C  2.371185 0.006481 0.050272
C  0.374776 0.531126 1.611049
C  -0.534198 1.534861 0.880676
C  3.708484 0.586947 -0.407768
C  -1.879332 1.100978 0.381542
C  1.637756 -2.405149 0.013956
C  -2.884929 2.098234 0.231475
C  -2.168485 -0.245382 0.022721
C  2.127282 -3.840859 0.184531
C  -4.168605 1.764539 -0.236136
C  -3.447359 -0.590877 -0.46383
C  -4.418129 0.419403 -0.570763
H  2.029501 1.85477 1.181045
H  2.494274 0.441338 2.178599
H  1.625665 0.137355 -0.756264
H  0.186479 0.709045 2.690723
H  0.084541 -0.510064 1.407906
H  3.555615 -1.705268 0.469748
H  -2.634217 3.132133 0.489044
H  -1.39145 -1.015283 0.062446
H  1.315999 -4.527879 -0.095348
H  3.007134 -4.044331 -0.452455
H  2.413941 -4.037445 1.233867
H  -4.959237 2.512283 -0.345247
H  -3.686458 -1.615091 -0.763567
H  4.445562 2.224937 -1.208906
