program: Gaussian 09
title: 000232791
version: EM64L-G09RevD.01
frameworkgroup: C1[X(C5H6N2O3)]
method: RPBEPBE
basis: SDD
operation: Freq
keyword: #pfreq=noraman
keyword: PBEPBE/SDD
title: #p freq=noraman PBEPBE/SDD
converged: YES YES NO NO
title: Mulliken charges:
elementType: O O O N N C C C C C H H H H H H
charge: -0.209132 -0.209135 -0.216504 -0.372936 -0.372934 -0.274187 0.186424 0.186423 -0.668393 0.180794 0.288776 0.257138 0.257133 0.223613 0.371461 0.371462
chargesum: 0.00000
title: Mulliken charges with hydrogens summed into heavy atoms:
elementType: O O O N N C C C C C
charge: -0.209132 -0.209135 -0.216504 -0.001475 -0.001472 0.014588 0.186424 0.186423 0.069490 0.180794
polarizability: 9.73742221e+01 3.46140837e-04 8.27450594e+01 -4.24732148e+00 -6.54492615e-04 4.40767672e+01
1716.lowfreq: -8.3051 -5.2988 -0.0014 -0.0007 -0.0005 12.9410 20.4924 134.2646 156.0752
frequency: 19.0564 134.2610 156.0741 219.9152 248.0010 272.7730 355.6941 362.8166 453.6112 475.4566 579.6542 593.3259 650.7989 683.1330 708.7710 758.2152 793.0784 817.0439 868.4719 985.6406 1026.5181 1058.5282 1078.9969 1240.2879 1245.9833 1281.0000 1315.4869 1362.2651 1373.3920 1377.7824 1386.7020 1473.2885 1479.7654 1631.0289 1660.0582 1678.7393 3004.3741 3014.7913 3108.3298 3127.0189 3519.4887 3521.3497
redmass: 4.4208 5.7906 11.4781 1.0973 2.5190 4.2344 12.3218 11.9159 6.8754 9.6193 4.0173 10.5830 2.8877 2.3903 6.4202 1.5555 1.6655 2.9488 2.2442 3.6290 1.9058 3.0299 1.6607 4.9276 1.2814 1.4951 3.8096 9.6980 1.6551 1.4524 1.4803 1.0484 1.0569 6.8292 8.8776 5.5399 1.0360 1.0801 1.1006 1.1025 1.0757 1.0783
irintensity: 4.0074 0.0048 11.0625 0.0001 1.7325 2.3086 28.9644 17.2364 28.7197 15.8255 6.6401 0.5001 1.1297 28.8590 0.3550 0.5916 233.5204 15.9267 0.3700 0.1357 16.2660 2.5388 0.0766 114.9356 10.1651 8.4007 296.9374 256.5441 4.5202 7.8719 50.6368 22.4689 6.3476 383.9568 106.5705 569.7936 13.2897 2.5415 15.7817 4.4154 89.9577 39.6523
temp: 298.150 k
press: 1.00000 atm
elementType: 8 8 8 7 7 6 6 6 6 6 1 1 1 1 1 1
symmnumber: 1
zpe: 305651.7 jmol-1
zpe.correction: 0.116417 hartree
zpe.thermalcorrener: 0.125370 hartree
zpe.thermalcorrenthalpy: 0.126315 hartree
zpe.thermalcorrgfe: 0.081237 hartree
zpe.sumelectzpe: -528.613933 hartree
zpe.sumelectthermal: -528.604979 hartree
zpe.sumelectthermalent: -528.604035 hartree
zpe.sumelectthermalfe: -528.649113 hartree
dipole: 0.5133 0.0000 0.3449
dipole: 0.6184
quadrupole: -65.2026 -67.9542 -55.9478
quadrupole: 0.0001 2.4677 0.0007
quadrupole: -2.1678 -4.9193 7.0871 0.0001 2.4677 0.0007
hfenergy: -528.7303495 hartree
pointgroup: C01 [X(C5H6N2O3)]
dipole: 0.2190225 0.0000374 -0.1059748 debye
dipolederiv: -0.6603006 0.1792136 -0.0912251 0.3084103 -0.9829603 0.1495334 -0.0996447 0.0919784 -0.3820788 -0.6603102 -0.1791822 -0.0913454 -0.3083415 -0.9828493 -0.14991 -0.0997181 -0.0921896 -0.3821876 -1.2170286 0.0000586 -0.2373603 0.0000593 -0.6020465 -0.0000497 -0.2532531 -0.0000592 -0.4410919 -1.1875077 0.6611629 -0.2316526 0.3261196 -0.8341243 0.1144179 -0.2709321 0.1976997 -0.3973622 -1.1874794 -0.6610327 -0.231977 -0.3259822 -0.8339773 -0.1146779 -0.2711364 -0.1980064 -0.3975283 -0.3090964 0. 0.0180808 -0.0000265 -0.2886397 -0.0000769 0.045819 -0.0001215 0.0697743 1.3914385 -0.4323813 0.3353986 -0.1175303 1.085779 -0.1490315 0.3845786 -0.1757984 0.3178413 1.3914494 0.4322268 0.3356276 0.1173444 1.0856045 0.1494721 0.3845411 0.1761692 0.3179866 0.1402003 -0.0000069 -0.0017784 0.0000337 -0.0456904 -0.0000438 -0.0951534 -0.0000571 0.1107422 1.7312746 -0.0001144 0.3868099 -0.0001252 1.8307227 0.000409 0.4334811 0.0004083 0.4682273 0.116833 0.0000077 -0.0265745 0.000005 0.0487802 0.0000164 -0.0214905 0.0000151 -0.005465 0.0333061 -0.0757971 0.0090125 -0.1150829 -0.0022045 -0.0262257 -0.000634 -0.0294379 0.0832783 0.0332881 0.0757999 0.0090564 0.1150839 -0.0022359 0.0261763 -0.0005664 0.0293886 0.0833087 0.0379969 0.0000259 -0.0858862 0.0000001 0.1026703 0.0000602 -0.0146493 0.0000598 -0.1093239 0.1729638 0.033494 -0.0480813 0.0465127 0.2105795 0.0149114 -0.0606041 0.0149972 0.3319498 0.1729723 -0.0334746 -0.0481049 -0.0464805 0.2105922 -0.0149811 -0.0606376 -0.0150463 0.3319292 unknown
polarizability: 95.1401805|-0.0026249|82.7450571|11.4942386|0.0091687|46.310811 unknown
InChI: InChI=1S/C5H6N2O3/c1-2-3(8)6-5(10)7-4(2)9/h2,6-7H,1H3
charge 0 multiplicity 1
16 atoms
O  0.937122 -2.433537 0.551177
O  0.937077 2.43339 0.552379
O  -2.845604 0.000186 -0.639198
N  -0.917285 -1.184345 -0.05106
N  -0.917335 1.184456 -0.050369
C  1.210281 -0.000064 0.53048
C  0.424908 -1.302374 0.358004
C  0.424831 1.302306 0.358829
C  2.45508 0.000261 -0.410158
C  -1.644838 0.000105 -0.275529
H  1.593935 -0.000371 1.569317
H  3.057944 0.901197 -0.214099
H  3.058005 -0.900751 -0.214641
H  2.152452 0.000569 -1.471921
H  -1.43985 -2.055723 -0.190577
H  -1.439923 2.055894 -0.189436
