program: Gaussian 09
title: 000232790
version: EM64L-G09RevD.01
frameworkgroup: C1[X(C5H6N2O3)]
method: RPBEPBE
basis: SDD
operation: Freq
keyword: #pfreq=noraman
keyword: PBEPBE/SDD
title: #p freq=noraman PBEPBE/SDD
converged: NO YES NO NO
title: Mulliken charges:
elementType: O O O N N C C C C C H H H H H H
charge: -0.442171 -0.399323 -0.252573 -0.384480 -0.111860 0.150065 -0.396355 0.176130 -0.381213 0.164705 0.362469 0.265176 0.241163 0.270631 0.359884 0.377753
chargesum: 0.00000
title: Mulliken charges with hydrogens summed into heavy atoms:
elementType: O O O N N C C C C C
charge: -0.082287 -0.021570 -0.252573 -0.022011 -0.111860 0.150065 0.109984 0.176130 -0.110582 0.164705
polarizability: 9.17669900e+01 -2.04523849e+00 1.00905817e+02 -6.86900413e-01 -4.54352478e-01 4.03276038e+01
1716.lowfreq: -8.4703 -4.3302 -0.0002 0.0004 0.0007 6.5404 73.6240 148.7906 174.6199
frequency: 73.6180 148.7887 174.6192 187.2226 212.2505 319.2132 344.7048 390.8608 491.2895 508.4454 513.2846 552.2524 571.8036 656.8871 667.1874 722.9825 828.0303 840.2536 906.7702 927.6887 946.5104 985.3681 1019.8404 1134.0951 1152.2608 1189.4083 1229.5064 1247.9873 1315.9627 1339.9897 1377.3067 1440.0250 1459.0149 1560.5765 1598.9702 1672.2519 3017.3949 3083.4735 3216.1586 3467.1216 3527.9074 3573.5695
redmass: 3.3027 4.8136 7.1292 4.6439 4.7641 5.8270 1.1559 6.7338 7.0786 1.4557 2.7002 4.5174 4.2603 5.6764 6.5110 3.2239 1.6581 1.1912 4.3035 5.2644 2.0275 3.5812 4.3466 1.5785 1.1482 2.7240 1.9629 2.2591 1.3335 1.2527 3.1247 1.8484 1.4778 6.4004 6.3894 7.5300 1.0590 1.1052 1.0938 1.0771 1.0641 1.0668
irintensity: 10.3289 0.2335 5.1581 7.5042 9.2837 6.0908 192.6357 1.8735 13.3363 111.9378 48.4118 12.6058 9.4443 3.2640 3.9105 0.2941 34.3554 98.0950 26.0846 55.2698 58.7078 7.1713 12.8245 233.7944 45.4178 24.2969 39.3407 0.3935 11.1223 1.3396 256.4014 28.0083 3.3672 183.5932 23.5206 675.6681 14.8086 8.0657 0.6563 92.5843 65.0735 17.1047
temp: 298.150 k
press: 1.00000 atm
elementType: 8 8 8 7 7 6 6 6 6 6 1 1 1 1 1 1
symmnumber: 1
zpe: 302612.5 jmol-1
zpe.correction: 0.115259 hartree
zpe.thermalcorrener: 0.124215 hartree
zpe.thermalcorrenthalpy: 0.125159 hartree
zpe.thermalcorrgfe: 0.081090 hartree
zpe.sumelectzpe: -528.564247 hartree
zpe.sumelectthermal: -528.555291 hartree
zpe.sumelectthermalent: -528.554347 hartree
zpe.sumelectthermalfe: -528.598416 hartree
dipole: -2.9909 -4.4143 -1.1613
dipole: 5.4571
quadrupole: -58.3295 -65.5155 -55.2481
quadrupole: -1.8416 4.8544 -0.3494
quadrupole: 1.3682 -5.8178 4.4496 -1.8416 4.8544 -0.3494
hfenergy: -528.6795063 hartree
pointgroup: C01 [X(C5H6N2O3)]
dipole: -1.664662 -0.9696297 -0.9477872 debye
dipolederiv: -0.8058716 0.1046593 -0.1107752 0.1986723 -0.6235485 0.039254 -0.125964 0.0366956 -0.1421209 -0.3637735 0.5071373 0.1741566 0.3281108 -1.2084423 -0.25254 0.1179027 -0.2506978 -0.500206 -0.5734319 -0.2522086 -0.1014343 -0.3713284 -1.1718507 -0.2996373 -0.1357404 -0.2819486 -0.479084 -0.8574488 -0.421816 -0.1994154 0.0615198 -0.6642194 -0.1370327 0.0083421 -0.1826361 -0.2802067 -1.1180241 0.2761249 0.0449304 0.3486821 -0.6732292 -0.1336059 0.0435375 -0.1283991 -0.2995663 0.557039 0.0062359 -0.0140068 -0.3122614 0.7601027 0.2379021 -0.1835865 0.2574521 0.1751368 0.3474156 -0.1518732 0.0645039 -0.3234902 0.4924381 -0.0680924 0.1581416 -0.0846943 0.2225365 1.0030241 0.3150277 0.1582624 0.4639343 1.5342014 0.4895078 0.1961973 0.4696976 0.3691057 -0.1424238 0.0174062 0.0074447 -0.0856965 -0.949183 -0.2543663 -0.0257711 -0.2479124 -0.3087585 0.9560498 -0.2626266 -0.047229 -0.2661079 1.4779573 0.4375377 -0.0375315 0.4364032 0.3125571 0.3074285 -0.0448663 0.0047515 -0.0171955 0.2258609 -0.0283171 0.0143864 -0.0222195 0.3164109 0.0081288 0.0014764 0.0357609 0.0617336 0.0368256 0.0521074 0.0429347 0.0835995 -0.0022592 0.041746 0.0301947 -0.0389242 0.0100595 -0.0265364 -0.0773479 -0.0790433 -0.0956763 -0.0115433 0.0098622 0.0158432 -0.0036973 -0.0144549 0.1060236 -0.0310626 -0.0131238 -0.0277138 0.1834842 0.4226076 -0.0174896 0.0762378 0.0043828 0.2694851 0.0211088 0.059004 0.0345119 0.0596655 0.2076722 -0.1232255 -0.050566 -0.0865604 0.4141149 0.0045843 -0.0396856 0.003538 0.3848484 unknown
polarizability: 91.3082015|0.2858812|95.3629348|3.8419266|17.7741326|46.3292743 unknown
InChI: InChI=1S/C5H6N2O3/c8-2-3-6-4(9)1-5(10)7-3/h1,6,8,10H,2H2
charge 0 multiplicity 1
16 atoms
O  -3.028695 1.233781 -0.045396
O  1.764449 -2.302922 -0.680005
O  1.579728 2.272962 0.891588
N  -0.341843 1.023986 0.378295
N  -0.287974 -1.214891 -0.412534
C  -0.958343 -0.119517 -0.05595
C  -2.480647 -0.126846 -0.07141
C  1.098983 1.17429 0.493611
C  1.811766 -0.030244 0.108413
C  1.101447 -1.146657 -0.312704
H  -0.933357 1.825952 0.634245
H  -2.851053 -0.605858 0.851195
H  -2.829323 -0.722407 -0.934715
H  2.900553 -0.03273 0.159792
H  -3.057288 1.605386 -0.962719
H  1.085999 -2.979388 -0.945708
