program: Gaussian 09
title: 000232789
version: EM64L-G09RevD.01
frameworkgroup: C1[X(C5H3Cl3N2)]
method: RPBEPBE
basis: SDD
operation: Freq
keyword: #p
keyword: freq=noraman
keyword: PBEPBE/SDD
title: #p freq=noraman PBEPBE/SDD
converged: NO NO NO NO
title: Mulliken charges:
elementType: Cl Cl Cl N N C C C C C H H H
charge: 0.023018 0.023220 0.051908 0.149027 0.148966 0.513420 -0.739500 -0.286829 -0.286004 -0.355999 0.248463 0.248112 0.262198
chargesum: 0.00000
title: Mulliken charges with hydrogens summed into heavy atoms:
elementType: Cl Cl Cl N N C C C C C
charge: 0.023018 0.023220 0.051908 0.149027 0.148966 0.513420 0.019273 -0.286829 -0.286004 -0.355999
polarizability: 1.32058048e+02 -2.52109281e-02 1.18780121e+02 5.59432047e-01 3.32386117e-03 3.96260528e+01
1716.lowfreq: -12.0029 -7.6403 -6.2141 -0.0013 0.0031 0.0033 44.8835 73.6186 132.6021
frequency: 44.3684 73.6179 132.6014 192.6811 193.6973 202.6720 297.9342 319.0823 347.7872 387.2116 412.5811 520.3479 575.3786 624.6028 669.0757 739.0906 755.3596 797.4320 1016.1887 1039.5116 1069.0596 1193.5108 1235.5402 1274.3252 1335.9560 1405.4973 1427.2760 1456.8137 1481.4693 1529.5708 2989.7798 3077.2209 3115.9588
redmass: 1.0752 4.7673 14.4691 18.3791 17.2169 23.4128 2.9576 4.5593 31.5300 10.0282 14.4985 6.1867 12.4051 7.8921 7.0753 9.0748 8.4116 12.1430 1.5448 1.4867 8.7497 12.0810 9.1498 9.1379 11.2669 1.1903 3.0078 1.0862 1.3874 8.7971 1.0401 1.0930 1.1006
irintensity: 1.0881 2.5971 0.0512 0.0362 0.0384 0.2332 1.5034 0.0076 0.9212 8.2964 6.4756 0.0213 0.0177 0.2017 32.3971 99.6531 0.9176 110.4714 88.5411 7.9524 46.8589 39.8177 41.9743 0.1772 364.8526 14.3526 177.4906 37.3104 185.4025 182.8195 4.0671 8.5166 1.8094
temp: 298.150 k
press: 1.00000 atm
elementType: 17 17 17 7 7 6 6 6 6 6 1 1 1
symmnumber: 1
zpe: 191003.0 jmol-1
zpe.correction: 0.072749 hartree
zpe.thermalcorrener: 0.082494 hartree
zpe.thermalcorrenthalpy: 0.083438 hartree
zpe.thermalcorrgfe: 0.035580 hartree
zpe.sumelectzpe: -1681.276594 hartree
zpe.sumelectthermal: -1681.266849 hartree
zpe.sumelectthermalent: -1681.265905 hartree
zpe.sumelectthermalfe: -1681.313764 hartree
dipole: 3.5454 0.0005 0.0475
dipole: 3.5457
quadrupole: -75.4585 -85.7879 -76.9273
quadrupole: 0.0033 0.1462 0.0003
quadrupole: 3.9327 -6.3967 2.4640 0.0033 0.1462 0.0003
hfenergy: -1681.3493435 hartree
pointgroup: C01 [X(C5H3Cl3N2)]
dipole: -1.3948387 -0.000372 -0.0196298 debye
dipolederiv: -0.2720949 0.3114229 -0.0013338 0.3405921 -0.72548 0.0017177 0.0018446 0.0023615 -0.0505424 -0.2727378 -0.3121848 -0.001715 -0.3409875 -0.7242669 -0.0024699 0.0014543 -0.0030717 -0.0506082 -0.9252922 0.000417 -0.0034774 0.0004325 -0.0770301 -0.000019 0.0010822 -0.0000165 -0.039524 -1.2305561 0.2936392 0.0000363 0.4126675 -0.6198935 0.0039373 -0.0035645 0.0047097 -0.0880161 -1.2313578 -0.2926355 -0.0003136 -0.4118607 -0.619178 -0.004504 -0.0040046 -0.0052609 -0.0880382 0.1633633 0.0005912 0.0109116 0.000721 -1.0073076 -0.0005525 0.0609474 -0.0006157 0.1014467 -0.2383321 -0.0007963 -0.0198261 -0.0041176 0.0352503 -0.0001112 -0.103745 0.0001345 0.0286198 0.8677726 -0.3243039 0.0093426 -0.5190048 1.4490426 -0.0104825 -0.001512 -0.0143609 0.0141243 0.8688599 0.324838 0.0098109 0.5195602 1.4478984 0.012083 -0.0009418 0.0159262 0.0136493 2.0897182 -0.0007994 0.0030007 -0.0006944 0.7046281 0.0003382 0.0044643 0.0003313 0.0397564 0.0753503 -0.0046148 0.012994 -0.0715728 0.0031518 0.090477 0.0474543 0.0582809 0.0849094 0.0765477 0.0046027 0.0125199 0.0742998 0.0007405 -0.0881843 0.0463484 -0.0568063 0.0876171 0.0287588 -0.0001764 -0.0319501 -0.0000352 0.1324445 -0.0022298 -0.0498277 -0.0016121 -0.0533941 unknown
polarizability: 132.0572379|0.0303057|118.7801253|0.6210621|0.0388751|39.6268586 unknown
InChI: InChI=1S/C5H3Cl3N2/c1-2-3(6)9-5(8)10-4(2)7/h1H3
charge 0 multiplicity 1
13 atoms
Cl -1.17111 2.800467 -0.007681
Cl -1.174745 -2.79825 -0.010675
Cl 3.39561 -0.001619 0.003428
N  0.990898 1.203541 -0.000574
N  0.989629 -1.204282 -0.001776
C  -1.150937 0.000862 0.015497
C  -2.658431 0.000743 0.012258
C  -0.355894 1.181967 0.004415
C  -0.35707 -1.181069 0.003205
C  1.596733 -0.000657 0.000898
H  -3.049442 -0.895035 0.521834
H  -3.04967 0.906296 0.503826
H  -3.04817 -0.010162 -1.023853
