program: Gaussian 09
title: 000232786
version: EM64L-G09RevD.01
frameworkgroup: C1[X(C14H24N2O2)]
method: RPBEPBE
basis: SDD
operation: Freq
keyword: #p
keyword: freq=noraman
keyword: PBEPBE/SDD
title: #p freq=noraman PBEPBE/SDD
converged: YES YES NO NO
title: Mulliken charges:
elementType: O O N N C C C C C C C C C C C C C C H H H H H H H H H H H H H H H H H H H H H H H H
charge: -0.215275 -0.232844 -0.424184 -0.400866 0.232801 -0.420498 -0.367534 -0.388309 -0.387853 -0.708169 0.136036 -0.386012 -0.373590 0.163008 -0.381801 -0.456581 -0.035255 -0.597649 0.229513 0.205009 0.206764 0.216591 0.192142 0.198924 0.198631 0.196294 0.248224 0.234829 0.215510 0.321106 0.196857 0.192815 0.197238 0.191427 0.348709 0.194381 0.212438 0.205476 0.198677 0.211762 0.213849 0.217409
chargesum: 0.00000
title: Mulliken charges with hydrogens summed into heavy atoms:
elementType: O O N N C C C C C C C C C C C C C C
charge: -0.215275 -0.232844 -0.103078 -0.052157 0.232801 0.014023 0.055821 0.002758 0.007071 -0.009606 0.136036 0.003660 0.015075 0.163008 0.025018 -0.052428 0.176507 -0.166391
polarizability: 2.00717025e+02 9.98256786e+00 1.59495241e+02 -8.31109414e+00 -2.39162019e+00 1.47697760e+02
1716.lowfreq: -5.8063 -4.2830 -0.0006 0.0007 0.0008 0.5459 16.6211 20.6913 26.8574
frequency: 15.5697 20.5691 26.7787 41.5944 56.6797 67.5903 73.6249 101.8281 110.1669 120.4340 140.1456 143.9298 153.8574 166.6187 185.8508 206.3640 219.9922 257.0959 279.6504 323.0431 340.3037 377.9715 414.6962 452.0789 463.0755 467.9013 514.5855 562.4922 605.9251 615.7609 636.7009 649.7365 701.2473 719.1052 720.5658 728.3634 742.1898 747.1756 782.9842 839.1098 904.0998 918.1010 926.8801 937.7193 940.8031 970.4615 982.7284 994.9320 1000.5700 1003.1192 1034.9097 1039.9252 1062.4966 1067.1826 1073.4092 1079.1903 1081.5473 1117.0749 1145.6118 1173.4644 1181.7170 1199.9783 1211.5655 1228.4245 1243.0369 1254.1218 1270.9400 1277.1197 1280.3565 1285.3144 1292.6389 1293.3644 1301.7884 1305.1784 1308.2671 1321.1012 1329.4422 1345.1583 1353.0870 1354.1860 1362.9908 1386.8339 1424.7438 1450.0001 1457.9222 1460.4307 1462.4075 1464.8605 1469.7635 1472.5917 1473.5708 1481.3715 1487.2919 1657.5943 1679.6353 1720.5597 2949.2705 2950.7270 2952.4256 2953.2789 2960.0703 2966.6441 2967.7252 2975.3582 2984.4581 2988.3551 2991.3578 3002.7415 3013.1458 3022.7010 3033.2505 3043.9804 3052.0354 3069.8965 3087.9666 3089.1747 3102.8002 3192.7788 3588.0320 3604.5560
redmass: 3.8189 2.4266 3.7455 4.7975 3.4029 2.0285 3.5194 2.2772 3.1148 2.2069 2.0958 3.1363 3.0279 4.9050 2.7658 1.3530 1.9420 3.0905 2.9227 3.6587 3.4884 5.0208 2.6173 2.9068 2.7148 1.1762 3.6028 3.4886 8.4808 4.2663 1.5445 1.1847 7.1859 1.1239 1.9494 1.2738 4.3997 1.3628 1.2916 1.3367 1.4696 2.0004 1.8803 1.7742 1.4223 3.0478 1.3294 4.0312 2.3684 1.2570 2.9739 1.6430 2.2848 1.4719 2.9225 2.3350 2.2746 3.9769 2.9253 2.0073 2.4154 1.5450 1.4773 1.7143 1.3497 1.4814 1.2717 1.1934 1.1535 1.1784 1.1729 1.1385 1.3876 1.4380 1.6145 3.5762 1.4634 1.5343 1.6292 1.6704 1.5591 1.2834 1.1792 1.0816 1.0909 1.0705 1.0764 1.0751 1.0646 1.0793 1.0762 1.1009 1.1010 4.7504 8.2376 9.4955 1.0589 1.0589 1.0615 1.0597 1.0598 1.0609 1.0610 1.0600 1.0960 1.0354 1.0980 1.0991 1.0995 1.1013 1.1029 1.1033 1.1031 1.0797 1.1002 1.0737 1.1006 1.1144 1.0802 1.0800
irintensity: 0.0840 0.0772 0.3819 0.2279 0.1185 0.0077 0.4194 0.1369 1.0692 0.1187 0.1811 0.4980 1.1038 0.2616 1.1068 0.4701 1.5249 1.9490 1.5115 0.2060 4.4361 10.9121 1.6017 0.7542 9.2908 122.4099 0.3859 13.1152 7.1520 9.6975 11.7914 154.9756 8.2395 15.3257 18.4404 7.5498 31.6100 9.1906 4.8565 0.7376 2.8452 2.0948 5.6141 15.4338 70.1722 16.6939 1.4913 0.9254 1.8903 13.4654 8.1911 3.0202 3.2458 1.3665 3.5584 1.4857 1.2062 14.4829 21.2317 22.3320 6.3025 14.4117 9.1383 30.1604 4.5104 23.6693 3.8344 3.8978 6.3939 4.4184 5.0068 2.8885 42.9298 21.6385 25.7358 124.1932 4.0586 0.3465 0.3211 0.5403 7.1177 10.7018 3.5577 3.6322 3.0051 0.2462 0.9915 0.2084 6.8458 2.1802 13.0709 0.1879 28.0082 22.0461 498.3778 373.3505 0.6158 3.8365 9.7089 5.0455 21.5031 87.0377 31.5382 86.7655 3.2213 25.5798 1.0996 3.2878 2.0721 1.2611 8.5641 106.7915 108.7073 48.2246 22.2246 7.3785 17.4622 33.3160 67.4791 37.5428
temp: 298.150 k
press: 1.00000 atm
elementType: 8 8 7 7 6 6 6 6 6 6 6 6 6 6 6 6 6 6 1 1 1 1 1 1 1 1 1 1 1 1 1 1 1 1 1 1 1 1 1 1 1 1
symmnumber: 1
zpe: 947081.5 jmol-1
zpe.correction: 0.360724 hartree
zpe.thermalcorrener: 0.381738 hartree
zpe.thermalcorrenthalpy: 0.382682 hartree
zpe.thermalcorrgfe: 0.306978 hartree
zpe.sumelectzpe: -806.443743 hartree
zpe.sumelectthermal: -806.422729 hartree
zpe.sumelectthermalent: -806.421785 hartree
zpe.sumelectthermalfe: -806.497489 hartree
dipole: -0.5172 -2.1296 -2.3371
dipole: 3.2039
quadrupole: -122.6858 -123.1241 -108.8099
quadrupole: -10.3205 -5.9167 9.6861
quadrupole: -4.4792 -4.9175 9.3967 -10.3205 -5.9167 9.6861
hfenergy: -806.8044671 hartree
pointgroup: C01 [X(C14H24N2O2)]
dipole: 0.2075251 0.8423257 -0.9144811 debye
polarizability: 200.5250565|10.0638946|159.5405847|8.7356848|2.5425457|147.8443852 unknown
InChI: InChI=1S/C14H24N2O2/c1-3-4-5-6-7-8-9-10-11-14(2)12(17)15-13(18)16-14/h3,15-16H,1,4-11H2,2H3
charge 0 multiplicity 1
42 atoms
O  -3.908608 0.977334 2.103712
O  -4.540577 -2.817944 -0.62956
N  -3.99855 -0.547834 -1.123284
N  -4.280809 -1.106133 1.026184
C  -3.780348 0.722412 -0.392515
C  -2.341435 1.287972 -0.582663
C  -1.199914 0.324798 -0.194463
C  0.194751 0.9159 -0.500911
C  1.351926 -0.015266 -0.075102
C  -4.841934 1.790552 -0.753415
C  -3.988352 0.258125 1.079661
C  2.74924 0.560124 -0.397393
C  3.905526 -0.361915 0.050601
C  -4.298626 -1.629999 -0.310114
C  5.302696 0.206997 -0.282577
C  6.457845 -0.720794 0.181514
C  7.824662 -0.193918 -0.201866
C  8.833719 0.083304 0.662252
H  -2.272307 2.209537 0.026845
H  -2.232792 1.593889 -1.64395
H  -1.318716 -0.636215 -0.733971
H  -1.263205 0.094006 0.888021
H  0.275079 1.127639 -1.588103
H  0.302623 1.89249 0.015461
H  1.27946 -0.212171 1.014783
H  1.235314 -0.998809 -0.576568
H  -4.756173 2.646001 -0.061828
H  -5.862218 1.376854 -0.675923
H  -4.686399 2.154699 -1.785353
H  -3.966673 -0.639419 -2.136838
H  2.860505 1.550396 0.091811
H  2.828166 0.742714 -1.489721
H  3.83183 -0.53648 1.144332
H  3.78998 -1.355994 -0.430583
H  -4.472828 -1.693951 1.837665
H  5.382271 0.370465 -1.377575
H  5.425297 1.201442 0.191461
H  6.403918 -0.862686 1.278614
H  6.306173 -1.721153 -0.278119
H  7.984281 -0.02245 -1.279179
H  9.799994 0.468268 0.316665
H  8.720212 -0.068285 1.743292
