program: Gaussian 09
title: 000232783
version: EM64L-G09RevD.01
frameworkgroup: C1[X(C19H21NO)]
method: RPBEPBE
basis: SDD
operation: Freq
keyword: #p
keyword: freq=noraman
keyword: PBEPBE/SDD
title: #p freq=noraman PBEPBE/SDD
converged: YES YES NO NO
title: Mulliken charges:
elementType: O N C C C C C C C C C C C C C C C C C C C H H H H H H H H H H H H H H H H H H H H H
charge: -0.415474 -0.057896 -0.218254 0.419608 0.061284 -0.523788 -0.672308 -0.721899 0.038057 0.386930 -0.551415 -0.808158 -0.282797 -0.224586 0.486157 -0.304804 -0.380132 -0.395112 -0.236634 -0.235167 -0.240305 0.181563 0.242177 0.227365 0.214069 0.223333 0.229097 0.220615 0.210249 0.256957 0.214530 0.253412 0.233801 0.352544 0.208922 0.249203 0.215106 0.229809 0.227909 0.227410 0.227826 0.230795
chargesum: 0.00000
title: Mulliken charges with hydrogens summed into heavy atoms:
elementType: O N C C C C C C C C C C C C C C C C C C C
charge: -0.062930 -0.057896 -0.036691 0.419608 0.061284 -0.281611 -0.007542 -0.061937 0.038057 0.386930 -0.294458 -0.106415 -0.073875 0.024617 0.486157 -0.089698 -0.150324 -0.167202 -0.009224 -0.007340 -0.009510
polarizability: 5.56770939e+02 -2.96538604e+01 2.22661892e+02 4.46671524e+00 1.89256641e+01 1.19704824e+02
1716.lowfreq: -5.3245 -3.8341 0.0002 0.0006 0.0009 4.9257 21.7405 25.6280 34.2339
frequency: 21.6467 25.5487 34.2058 53.1218 66.6805 77.4299 90.7845 99.0416 141.1260 176.4711 188.3170 191.7663 212.1896 234.3500 248.2677 267.4982 280.4346 290.1396 316.0807 318.3192 327.5210 353.0868 402.4093 403.8651 430.7412 438.6163 452.6033 469.3173 509.1261 516.7967 570.1186 577.6286 615.2332 616.9320 661.6828 679.2310 694.0353 729.2651 743.7386 767.4486 814.5009 844.2904 850.4200 875.3301 877.5621 882.6727 888.2413 917.2609 925.5705 951.9202 961.9482 977.9327 987.2816 989.2771 998.7540 1001.0658 1025.6475 1034.6469 1047.3862 1081.2846 1090.6373 1115.5779 1126.9738 1154.3450 1165.9918 1172.7627 1189.9392 1190.5558 1210.9244 1228.7412 1259.6557 1262.2378 1281.4395 1284.1400 1295.0717 1326.1221 1333.7865 1359.1871 1380.7486 1385.7714 1392.9779 1395.4686 1398.6321 1411.5923 1441.3162 1449.4567 1465.7318 1471.5910 1476.6545 1482.4103 1483.4018 1493.2181 1499.1671 1546.8992 1576.7503 1583.1948 1609.7339 1622.1717 1632.6206 2892.5896 2937.1483 2975.8927 2982.0857 2983.1688 3063.2375 3071.4809 3073.9986 3077.6100 3080.3518 3085.0235 3095.6369 3118.2194 3126.8740 3132.5630 3140.1324 3145.0711 3150.6833 3154.3068 3166.0036 3573.4137
redmass: 3.5688 4.4087 4.5955 3.3096 1.1329 2.8706 3.7197 4.4342 3.5213 3.3218 2.8425 3.0706 2.5053 1.5819 2.4634 1.5616 1.8209 3.3901 1.2156 3.1442 3.0164 3.8859 3.0550 2.8258 4.9565 5.0305 4.2209 3.0547 2.9583 3.0261 4.9163 4.2041 5.9567 4.8025 5.3159 4.2834 1.6970 5.4043 2.8962 1.7539 3.9662 1.3050 4.1420 1.5331 1.5935 2.0640 1.6347 1.1822 1.5693 1.5595 1.4471 1.3914 5.9583 1.2460 1.4331 1.2781 2.1926 2.6396 1.5912 1.6635 1.9011 2.5725 1.8306 2.0067 1.9362 1.0739 1.4645 1.4821 2.3490 1.5348 1.9820 1.5625 1.5302 1.7277 1.8846 1.4050 1.5765 1.7607 1.2163 4.3249 2.3717 1.6351 1.2883 2.8182 2.3245 1.0698 1.0474 1.0843 1.1583 1.9317 1.2361 1.0580 2.7343 5.6610 6.1365 5.7009 6.0800 6.3162 5.6548 1.0816 1.0857 1.0351 1.0356 1.0375 1.0949 1.1003 1.0996 1.0891 1.0995 1.1001 1.1006 1.0871 1.0866 1.0899 1.0913 1.0889 1.0958 1.0919 1.1015 1.0653
irintensity: 0.2774 0.1816 0.6199 0.1088 0.8920 0.3029 1.8616 0.2101 3.5027 3.3582 4.7311 3.6552 8.5735 0.2789 0.0904 0.2954 2.0870 15.3993 110.8110 2.2167 1.5638 1.3716 13.9950 2.0999 16.9857 8.9518 0.8256 11.0518 6.3246 2.2432 2.9636 1.2951 1.8085 7.9054 3.5040 1.2890 47.7580 7.0236 2.2315 58.7961 25.2825 0.2062 10.0383 2.9633 1.2143 14.5609 28.8955 5.5628 0.9043 2.3257 2.0597 0.0302 0.3849 38.0266 20.4581 29.2647 4.0537 13.4218 17.3875 7.3497 7.9891 31.6707 79.4730 121.1875 10.7807 0.1979 0.2564 2.8909 122.5694 4.8651 12.0019 5.0478 7.7726 31.7172 21.1140 6.5807 40.3985 6.6081 14.4516 18.7126 7.7180 29.9610 5.0245 23.6759 10.0510 19.2977 8.2460 60.6509 32.0198 15.8357 20.1460 8.9080 45.8759 35.4702 19.5667 32.9158 7.7627 23.8029 56.1841 45.1397 59.2964 41.8313 22.3504 27.6419 19.5300 20.9625 26.7547 20.2669 66.0699 39.1321 22.7722 9.3296 7.9504 19.2714 6.6217 7.5272 38.5158 12.2673 44.2331 73.2467
temp: 298.150 k
press: 1.00000 atm
elementType: 8 7 6 6 6 6 6 6 6 6 6 6 6 6 6 6 6 6 6 6 6 1 1 1 1 1 1 1 1 1 1 1 1 1 1 1 1 1 1 1 1 1
symmnumber: 1
zpe: 906164.6 jmol-1
zpe.correction: 0.345140 hartree
zpe.thermalcorrener: 0.366103 hartree
zpe.thermalcorrenthalpy: 0.367047 hartree
zpe.thermalcorrgfe: 0.293592 hartree
zpe.sumelectzpe: -865.066081 hartree
zpe.sumelectthermal: -865.045118 hartree
zpe.sumelectthermalent: -865.044174 hartree
zpe.sumelectthermalfe: -865.117629 hartree
dipole: 0.6768 -3.1647 -0.4909
dipole: 3.2733
quadrupole: -108.2084 -115.7083 -129.7218
quadrupole: 10.6468 1.3189 4.7663
quadrupole: 9.6711 2.1712 -11.8422 10.6468 1.3189 4.7663
hfenergy: -865.4112206 hartree
pointgroup: C01 [X(C19H21N1O1)]
dipole: -0.2348161 -1.2171171 0.3492354 debye
polarizability: 555.2426933|37.0509998|217.910601|-4.278668|-31.4857464|125.9843605 unknown
InChI: InChI=1S/C19H21NO/c1-14(2)17-13-18(15(3)12-19(17)21)20-11-7-10-16-8-5-4-6-9-16/h4-14,21H,1-3H3
charge 0 multiplicity 1
42 atoms
O  5.92705 0.70307 0.257893
N  0.31983 1.076844 -0.273193
C  4.444175 -1.856861 0.243041
C  3.746495 -0.492888 0.167657
C  4.521397 0.705186 0.150868
C  2.349556 -0.349954 0.048511
C  5.076709 -2.223397 -1.133291
C  3.530299 -3.002715 0.732685
C  1.716706 0.919157 -0.099049
C  2.523431 2.104553 -0.149226
C  3.918683 1.971244 -0.009812
C  1.880595 3.465259 -0.316111
C  -0.550806 0.226018 0.234924
C  -1.969156 0.363318 -0.034244
C  -4.364192 -0.452663 0.266233
C  -2.912569 -0.499051 0.476722
C  -5.004686 0.536875 -0.53919
C  -5.182666 -1.438952 0.891923
C  -6.402459 0.535019 -0.706939
C  -6.582563 -1.440537 0.723669
C  -7.2007 -0.452473 -0.077522
H  5.270908 -1.784888 0.989468
H  1.726761 -1.250481 0.0265
H  4.280649 -2.366264 -1.886315
H  5.65639 -3.16265 -1.062609
H  5.746953 -1.42869 -1.509707
H  3.056227 -2.76015 1.700563
H  4.118595 -3.929739 0.857836
H  2.731306 -3.217348 -0.000843
H  4.566639 2.853267 -0.026953
H  2.633837 4.236297 -0.552165
H  1.118525 3.434992 -1.113811
H  1.350666 3.772434 0.605272
H  6.264223 -0.209094 0.440204
H  -0.25041 -0.609066 0.904974
H  -2.246133 1.205227 -0.6805
H  -2.553785 -1.320529 1.116939
H  -4.405483 1.30838 -1.034762
H  -4.70796 -2.207363 1.51512
H  -6.875954 1.302768 -1.329207
H  -7.190727 -2.208355 1.214663
H  -8.288054 -0.449899 -0.211118
