program: Gaussian 09
title: 000232779
version: EM64L-G09RevD.01
frameworkgroup: C1[X(C17H19NO)]
method: RPBEPBE
basis: SDD
operation: Freq
keyword: #p
keyword: freq=noraman
keyword: PBEPBE/SDD
title: #p freq=noraman PBEPBE/SDD
converged: YES YES NO NO
title: Mulliken charges:
elementType: O N C C C C C C C C C C C C C C C C C H H H H H H H H H H H H H H H H H H H
charge: -0.416246 -0.059209 -0.217990 0.420540 -0.526994 0.059802 -0.720109 -0.671637 0.048117 0.387726 -0.553987 -0.808943 -0.381355 0.434876 -0.372811 -0.378414 -0.235219 -0.221423 -0.234415 0.179942 0.242996 0.210154 0.220492 0.228924 0.224264 0.213869 0.226663 0.256686 0.216235 0.234922 0.247656 0.351601 0.213035 0.225468 0.270440 0.227345 0.227620 0.229377
chargesum: 0.00000
title: Mulliken charges with hydrogens summed into heavy atoms:
elementType: O N C C C C C C C C C C C C C C C C C
charge: -0.064645 -0.059209 -0.038048 0.420540 -0.283998 0.059802 -0.060539 -0.006840 0.048117 0.387726 -0.297301 -0.110130 -0.168319 0.434876 -0.147343 -0.107973 -0.007875 0.006197 -0.005038
polarizability: 3.77662239e+02 1.87595658e+01 2.00741930e+02 -6.72159136e+00 1.62909659e+01 1.12240978e+02
1716.lowfreq: -6.0982 -3.5166 -0.0008 -0.0005 -0.0003 4.1709 28.3803 35.6447 46.7934
frequency: 28.3676 35.5930 46.7885 62.4138 80.5779 104.2873 124.2368 135.2069 186.2851 193.5246 212.5647 231.8850 246.9942 257.7610 267.5003 281.3036 333.4280 337.1975 348.8953 405.3624 407.0278 419.3608 441.8977 465.1248 492.4581 501.8718 523.7659 582.6826 612.2789 616.9638 663.3544 682.7026 699.0875 728.4533 742.2161 772.1689 816.8168 852.7322 855.7893 877.6444 883.9656 886.7974 916.6372 926.5345 958.1479 976.2929 985.8336 988.0024 1000.9522 1005.0011 1021.3266 1033.5318 1047.7545 1078.1134 1091.0004 1116.1934 1129.2747 1160.0061 1168.0919 1171.8017 1179.8404 1212.1910 1236.1733 1262.0074 1283.9656 1286.6531 1311.8799 1336.9306 1360.7104 1377.1178 1388.6319 1394.3611 1396.6938 1399.6108 1411.2904 1439.2546 1452.1687 1464.1500 1469.5871 1476.7622 1479.4271 1481.8618 1489.7382 1500.1826 1557.3951 1580.0662 1600.4027 1613.6079 1628.2142 2895.3623 2936.2605 2975.4516 2980.9411 2983.0220 3062.6488 3071.6415 3073.4607 3079.6234 3085.0533 3092.8934 3114.6061 3127.7558 3140.6804 3141.2686 3154.4566 3156.0282 3166.8190 3572.8149
redmass: 3.6584 3.5432 4.2478 3.9730 3.0621 1.0543 4.4608 4.0969 3.5855 2.1019 2.2251 1.8289 4.0394 1.1415 2.7424 2.9345 2.2880 3.2599 1.5427 2.8769 2.9079 4.2653 4.3930 3.1576 4.9443 3.3012 3.5082 3.5607 6.1247 6.0074 5.6446 4.3997 1.7623 5.3524 2.8109 1.8075 4.1032 2.8248 1.2869 1.5919 2.5937 1.5698 1.1813 1.3814 1.4494 1.5926 1.4292 5.5299 1.4709 1.3476 2.1648 2.6390 1.5757 1.5885 1.9034 2.5181 1.7370 1.8636 1.7855 1.1423 1.1551 2.3241 2.2637 1.4799 1.3802 2.6559 1.5265 1.6483 1.8546 1.1982 3.8064 1.2882 1.3516 3.0009 3.0289 2.2828 1.0653 1.0488 1.0678 1.1686 1.6076 1.3861 1.0644 3.0738 6.2738 6.3941 5.9725 6.2975 6.7351 1.0816 1.0852 1.0350 1.0356 1.0369 1.0956 1.1003 1.0998 1.0995 1.1003 1.1006 1.0875 1.0867 1.0896 1.0920 1.0920 1.0957 1.1004 1.0652
irintensity: 0.4765 0.1894 0.3000 0.1245 0.7795 0.6626 0.9191 0.9133 7.4200 0.9267 2.1697 0.1658 2.0544 0.2247 12.3758 12.0680 39.7190 6.1899 68.5450 0.0206 0.3286 9.1581 10.5747 3.7680 16.6731 15.4023 15.1709 3.6932 0.2554 0.4921 2.4142 2.0662 51.5157 5.2474 3.6103 43.1304 15.2603 25.6170 0.8665 0.5081 13.8945 33.0888 4.9583 0.9974 2.0466 14.1179 0.7068 0.1758 20.6978 1.6214 9.9626 10.5300 15.0241 7.0795 6.5437 21.3620 80.8304 84.9066 32.6685 4.0495 0.0375 91.2451 2.2776 7.3288 28.4537 15.7497 23.6185 35.3732 7.9270 15.8561 6.8252 24.9547 14.8956 1.4504 13.5545 9.5514 20.3647 7.0111 27.1695 48.5670 9.4594 6.2913 8.3043 63.8964 23.8436 24.6683 9.3869 4.2870 54.0246 44.7359 59.5217 37.8838 23.5140 25.5371 17.2684 7.6105 39.3418 63.9842 39.7927 23.4112 9.0141 0.0118 6.5309 24.9482 10.4204 27.1779 31.4339 56.2515
temp: 298.150 k
press: 1.00000 atm
elementType: 8 7 6 6 6 6 6 6 6 6 6 6 6 6 6 6 6 6 6 1 1 1 1 1 1 1 1 1 1 1 1 1 1 1 1 1 1 1
symmnumber: 1
zpe: 820049.0 jmol-1
zpe.correction: 0.312340 hartree
zpe.thermalcorrener: 0.331013 hartree
zpe.thermalcorrenthalpy: 0.331957 hartree
zpe.thermalcorrgfe: 0.264694 hartree
zpe.sumelectzpe: -787.806124 hartree
zpe.sumelectthermal: -787.787451 hartree
zpe.sumelectthermalent: -787.786507 hartree
zpe.sumelectthermalfe: -787.853771 hartree
dipole: 0.0779 -2.8844 -0.4574
dipole: 2.9215
quadrupole: -98.5878 -106.0302 -116.3829
quadrupole: -7.7908 -0.9855 3.9017
quadrupole: 8.4125 0.9701 -9.3826 -7.7908 -0.9855 3.9017
hfenergy: -788.1184644 hartree
pointgroup: C01 [X(C17H19N1O1)]
dipole: 0.047076 1.0497855 0.4656796 debye
polarizability: 377.4639269|-18.7232445|186.7266227|-6.8644184|36.8588293|126.4545969 unknown
InChI: InChI=1S/C17H19NO/c1-12(2)15-10-16(13(3)9-17(15)19)18-11-14-7-5-4-6-8-14/h4-12,19H,1-3H3
charge 0 multiplicity 1
38 atoms
O  4.833649 -1.063868 -0.119058
N  -0.796497 -0.667456 -0.237773
C  3.697605 1.631222 0.337812
C  2.826567 0.384355 0.140013
C  1.417588 0.429899 0.115535
C  3.435124 -0.882411 -0.103106
C  2.981049 2.78615 1.073559
C  4.256159 2.126959 -1.029588
C  0.618502 -0.718058 -0.152308
C  1.255502 -1.972274 -0.425561
C  2.662346 -2.030301 -0.38177
C  0.429468 -3.206101 -0.723683
C  -1.512689 0.158155 0.486701
C  -2.971996 0.280609 0.32878
C  -3.694309 1.176604 1.164565
C  -3.680768 -0.478511 -0.645765
C  -5.092734 1.312778 1.032859
C  -5.076063 -0.342611 -0.774365
C  -5.788255 0.55345 0.06308
H  4.566885 1.352605 0.980057
H  0.914797 1.391329 0.265205
H  2.158603 3.199754 0.461281
H  3.691157 3.609867 1.269008
H  2.560514 2.453688 2.039414
H  4.782656 1.325361 -1.579336
H  4.957118 2.97048 -0.88681
H  3.425026 2.474814 -1.669549
H  3.186373 -2.972772 -0.56957
H  1.064354 -4.034744 -1.080912
H  -0.114831 -3.5513 0.175271
H  -0.340264 -2.98012 -1.482469
H  5.297792 -0.235776 0.160232
H  -1.060147 0.796161 1.277114
H  -3.154057 1.764252 1.918092
H  -3.109722 -1.161787 -1.282641
H  -5.639251 2.005908 1.681978
H  -5.615322 -0.930359 -1.525855
H  -6.874126 0.657848 -0.041138
