program: Gaussian 09
title: 000232776
version: EM64L-G09RevD.01
frameworkgroup: C1[X(C17H17Cl2NO)]
method: RPBEPBE
basis: SDD
operation: Freq
keyword: #p
keyword: freq=noraman
keyword: PBEPBE/SDD
title: #p freq=noraman PBEPBE/SDD
converged: YES YES NO NO
title: Mulliken charges:
elementType: Cl Cl O N C C C C C C C C C C C C C C C C C H H H H H H H H H H H H H H H H H
charge: -0.052626 -0.040760 -0.411744 -0.064026 -0.219314 0.419803 -0.516727 0.062913 -0.670767 -0.718226 0.043660 0.390348 -0.550951 -0.807352 -0.359838 0.540158 -0.278455 -0.363810 -0.226665 -0.216905 -0.094700 0.181481 0.243787 0.227363 0.216289 0.222681 0.230908 0.221966 0.210713 0.258696 0.236672 0.218873 0.244793 0.354260 0.240457 0.284408 0.282261 0.260376
chargesum: 0.00000
title: Mulliken charges with hydrogens summed into heavy atoms:
elementType: Cl Cl O N C C C C C C C C C C C C C C C C C
charge: -0.052626 -0.040760 -0.057484 -0.064026 -0.037834 0.419803 -0.272940 0.062913 -0.004435 -0.054638 0.043660 0.390348 -0.292255 -0.107015 -0.119381 0.540158 -0.278455 -0.079402 0.055596 0.043471 -0.094700
polarizability: 4.48055929e+02 -4.09382213e+00 2.25753118e+02 -1.18100030e+01 -8.58754147e+00 1.15226313e+02
1716.lowfreq: -4.7492 -3.6027 -0.0012 -0.0005 0.0022 4.3674 15.9074 27.9872 36.2077
frequency: 15.8370 27.7911 36.1928 51.4885 78.9539 92.2242 99.2292 115.2582 152.6956 160.6871 175.2895 192.9591 198.2298 212.7683 216.8421 238.4831 270.9448 281.8833 305.9096 314.1682 339.4499 348.4714 359.6757 373.8390 400.6784 419.5890 438.4414 456.8158 459.8296 477.3694 516.7339 545.6234 553.5101 584.5965 643.1636 664.4832 673.1902 714.4987 718.6437 736.9304 745.9753 825.0109 837.9651 856.0306 865.0293 880.0854 884.9181 891.0521 917.0504 961.0699 963.8701 987.5880 1000.0604 1020.2413 1036.2371 1047.1900 1078.0811 1092.1113 1116.0775 1123.8530 1130.7729 1160.2840 1172.9858 1210.3860 1222.2258 1258.7632 1262.2010 1282.1274 1290.3273 1331.0429 1340.1650 1371.8662 1381.2799 1386.8954 1396.0709 1398.1831 1399.9605 1411.9061 1452.4419 1454.7447 1465.9161 1471.0118 1476.1750 1484.1750 1491.8582 1500.4526 1542.7621 1558.6040 1585.5101 1594.6942 1627.2874 2892.4938 2976.0576 2982.7086 2984.8473 3007.3860 3064.8330 3072.1731 3074.3782 3080.8031 3086.1137 3095.4961 3142.3827 3155.5945 3156.2138 3177.5983 3185.1788 3571.0250
redmass: 6.9130 4.2873 6.4889 4.1613 3.0514 1.2243 3.3233 5.8582 7.9600 5.4355 4.0701 2.7849 4.7673 2.8763 4.1687 1.5204 1.2831 2.1130 3.7576 3.4188 1.2293 4.7201 4.4512 9.2330 4.4564 4.4800 3.5459 4.3280 3.8012 3.6273 3.3688 5.3245 5.0411 3.7427 6.7324 5.5594 4.5822 4.4261 5.9309 5.1332 3.0530 4.4091 1.3655 3.2797 1.4048 1.5021 2.6202 1.5760 1.1897 1.4333 1.5343 1.3986 1.4741 3.9159 2.5899 1.6003 2.3863 1.9144 2.4346 1.8057 1.3784 1.9230 2.0995 2.3634 1.7057 1.6357 1.6307 1.4026 2.5250 1.8201 2.4498 2.1948 1.2069 3.9546 1.3234 2.9573 1.4017 2.7897 1.0968 2.6629 1.0471 1.0784 1.1613 1.1175 1.0572 2.8444 7.1198 7.0103 6.3591 7.2909 6.7357 1.0820 1.0351 1.0358 1.0372 1.0866 1.0954 1.1005 1.0997 1.0995 1.1003 1.1005 1.0897 1.0887 1.0920 1.0966 1.0938 1.0652
irintensity: 0.4015 0.0068 0.7858 0.3534 0.2679 0.5128 0.8475 0.1589 2.1138 0.7300 3.5351 3.1728 7.5137 4.9710 2.1157 0.9643 0.7940 3.8275 13.0700 7.0952 100.2753 8.7530 4.2906 8.1502 25.7960 22.0373 4.4979 9.0551 3.3775 7.9856 1.9142 8.0349 9.0017 4.1584 5.2414 2.2921 5.8440 11.5660 4.8157 37.9158 1.9968 0.9945 30.5454 50.3701 19.8110 2.7217 16.3930 30.6058 6.0364 2.9049 7.7312 4.5367 17.4141 57.4466 6.8537 15.0820 57.0906 3.6525 32.4486 14.6453 140.2457 34.9463 22.7259 103.4137 0.7616 4.8287 13.6142 8.6230 63.0686 53.8576 5.1320 9.3878 17.4404 11.9214 41.7519 7.3667 5.6459 9.9530 20.4364 81.8320 9.4882 47.7729 33.2685 10.1212 9.6312 71.4200 42.9352 39.9384 45.5384 46.0464 61.9610 43.0500 37.9105 19.8493 23.6206 40.8749 17.1069 25.4819 17.4122 65.0354 39.0986 23.5963 5.4411 0.1450 9.7068 4.1057 0.7175 70.4709
temp: 298.150 k
press: 1.00000 atm
elementType: 17 17 8 7 6 6 6 6 6 6 6 6 6 6 6 6 6 6 6 6 6 1 1 1 1 1 1 1 1 1 1 1 1 1 1 1 1 1
symmnumber: 1
zpe: 769266.0 jmol-1
zpe.correction: 0.292998 hartree
zpe.thermalcorrener: 0.314306 hartree
zpe.thermalcorrenthalpy: 0.315250 hartree
zpe.thermalcorrgfe: 0.240884 hartree
zpe.sumelectzpe: -1706.584071 hartree
zpe.sumelectthermal: -1706.562763 hartree
zpe.sumelectthermalent: -1706.561819 hartree
zpe.sumelectthermalfe: -1706.636185 hartree
dipole: 2.3969 1.3989 0.4238
dipole: 2.8074
quadrupole: -136.5628 -130.8775 -141.4941
quadrupole: 13.3475 1.2173 0.2178
quadrupole: -0.2513 5.4340 -5.1827 13.3475 1.2173 0.2178
hfenergy: -1706.8770689 hartree
pointgroup: C01 [X(C17H17Cl2N1O1)]
dipole: 0.9626863 -0.5392716 0.0491645 debye
polarizability: 447.4279676|16.1351232|203.5455158|6.8217905|-45.5974164|138.0618763 unknown
InChI: InChI=1S/C17H17Cl2NO/c1-10(2)14-8-16(11(3)6-17(14)21)20-9-12-4-5-13(18)7-15(12)19/h4-10,21H,1-3H3
charge 0 multiplicity 1
38 atoms
Cl -2.642177 -2.253411 2.091006
Cl -7.080424 -0.278006 -0.551825
O  5.3511 0.991342 -0.064491
N  -0.278025 0.71632 -0.287945
C  4.153878 -1.682577 0.360896
C  3.31287 -0.417555 0.14992
C  1.905544 -0.434021 0.099271
C  3.951879 0.838361 -0.078368
C  4.72738 -2.185492 -0.997757
C  3.400307 -2.823827 1.080467
C  1.134633 0.731132 -0.181603
C  1.802041 1.973506 -0.440313
C  3.20841 2.002588 -0.369333
C  1.010966 3.227303 -0.749506
C  -1.023564 -0.140406 0.369867
C  -2.480558 -0.186613 0.162494
C  -3.331668 -1.083009 0.8624
C  -3.104207 0.689678 -0.775347
C  -4.724374 -1.128248 0.662836
C  -4.490769 0.676518 -1.000523
C  -5.283365 -0.238525 -0.273881
H  5.016229 -1.423465 1.020219
H  1.383688 -1.386517 0.239466
H  3.901336 -2.510085 -1.656103
H  5.403771 -3.046767 -0.84444
H  5.285483 -1.395719 -1.533489
H  2.966867 -2.484886 2.038278
H  4.090839 -3.660651 1.28934
H  2.582524 -3.223036 0.452491
H  3.755583 2.934078 -0.544705
H  0.470106 3.590286 0.14445
H  1.670985 4.03719 -1.103722
H  0.242263 3.021051 -1.514574
H  5.795398 0.151129 0.211433
H  -0.613302 -0.843749 1.118072
H  -2.447688 1.378548 -1.315948
H  -5.348796 -1.831671 1.218169
H  -4.951066 1.356105 -1.722705
