program: Gaussian 09
title: 000232774
version: EM64L-G09RevD.01
frameworkgroup: C1[X(C7H16NO3P)]
method: RPBEPBE
basis: SDD
operation: Freq
keyword: #p
keyword: freq=noraman
keyword: PBEPBE/SDD
title: #p freq=noraman PBEPBE/SDD
converged: YES YES NO NO
title: Mulliken charges:
elementType: P O O O N C C C C C C C H H H H H H H H H H H H H H H H
charge: 1.417076 -0.492503 -0.536201 -0.610676 -0.770718 -0.384585 -0.224830 -0.247453 -0.658354 -0.654288 -0.017979 -0.564408 0.350816 0.256578 0.225333 0.215200 0.215065 0.222449 0.220069 0.204979 0.234172 0.231627 0.207468 0.264551 0.228686 0.229339 0.220653 0.217935
chargesum: 0.00000
title: Mulliken charges with hydrogens summed into heavy atoms:
elementType: P O O O N C C C C C C C
charge: 1.417076 -0.492503 -0.536201 -0.610676 -0.419903 0.097327 0.205435 0.195065 0.012424 0.046417 0.211360 -0.125820
polarizability: 1.49546450e+02 1.48473728e+00 1.16191319e+02 6.26366384e+00 -2.05916809e+00 9.25056939e+01
1716.lowfreq: -7.2511 -2.4662 -0.0023 -0.0022 0.0012 9.6830 23.7209 31.9286 38.2196
frequency: 23.2406 31.8262 38.1259 52.9403 63.8553 80.6349 93.4459 130.3161 139.7078 189.5882 206.4018 235.8772 252.0174 272.9955 286.8083 309.9404 344.2938 381.5843 405.4265 457.2808 467.0899 500.3236 610.1761 631.4518 671.9437 792.8694 809.2778 814.3034 866.1612 878.8400 912.5848 948.7537 961.2186 1004.5786 1016.0986 1022.9604 1058.6663 1094.6402 1097.6062 1107.4850 1133.1799 1137.9171 1146.7858 1231.2535 1251.9698 1268.1059 1277.0035 1328.3032 1346.6929 1353.4398 1394.1744 1394.7920 1395.7423 1428.0309 1457.2217 1460.5552 1467.9158 1468.7615 1479.1750 1487.3823 1491.6037 1656.7244 2967.9466 2978.4594 2987.2661 2992.5108 2994.3088 3027.2719 3036.2806 3072.2928 3085.5327 3086.8488 3090.9243 3105.4721 3108.0958 3108.7147 3197.9881 3566.2641
redmass: 3.6549 3.0137 2.8977 2.8584 1.9140 2.3723 3.8753 3.7219 2.8145 3.3484 3.6599 1.2897 1.3527 3.3572 3.6818 2.6018 4.2046 3.4828 1.9218 3.7082 5.6366 1.5515 5.2149 1.9664 4.5376 3.7091 1.1173 1.0913 3.3354 3.5659 1.5807 1.5138 1.6600 1.1867 3.0783 2.9152 6.4606 2.4992 2.8292 2.6401 1.4235 1.9228 1.5498 1.2126 1.1515 1.1240 1.2546 1.2123 1.2220 1.2642 1.2725 1.2424 1.2262 1.1932 1.0401 1.0412 1.0750 1.0747 1.0487 1.0551 1.0819 4.6440 1.0552 1.0600 1.0397 1.0596 1.0368 1.1078 1.1022 1.1021 1.0974 1.0604 1.0982 1.0946 1.1029 1.1016 1.1143 1.0762
irintensity: 0.1834 1.3380 0.8097 0.2118 2.9348 0.5636 0.7769 4.3791 4.2882 17.4327 0.8704 2.5128 2.1785 12.9380 2.2386 5.1644 7.3449 5.8224 24.1143 45.0641 48.0814 42.7616 27.6069 65.5805 182.6838 107.5142 4.8495 1.4950 166.1696 120.2938 21.3615 41.2015 47.9203 23.5758 182.5423 133.0445 88.3821 58.8015 37.3359 50.8370 6.4987 10.8781 9.5631 22.6557 0.8749 0.3090 0.9635 0.2436 14.9251 4.7678 19.1601 38.6166 41.9224 17.8805 10.9505 12.6975 6.3460 8.8919 6.5007 12.7434 6.1400 7.4601 36.0331 38.8419 23.1729 31.6874 27.0982 29.6864 8.8858 7.8296 31.9483 15.4909 29.0327 9.9716 33.3752 30.3311 24.8442 30.3539
temp: 298.150 k
press: 1.00000 atm
elementType: 15 8 8 8 7 6 6 6 6 6 6 6 1 1 1 1 1 1 1 1 1 1 1 1 1 1 1 1
symmnumber: 1
zpe: 602476.7 jmol-1
zpe.correction: 0.229471 hartree
zpe.thermalcorrener: 0.245909 hartree
zpe.thermalcorrenthalpy: 0.246853 hartree
zpe.thermalcorrgfe: 0.182993 hartree
zpe.sumelectzpe: -896.960097 hartree
zpe.sumelectthermal: -896.943659 hartree
zpe.sumelectthermalent: -896.942715 hartree
zpe.sumelectthermalfe: -897.006576 hartree
dipole: -0.5126 2.0302 -4.0160
dipole: 4.5291
quadrupole: -69.0549 -77.5779 -88.7062
quadrupole: 1.3393 -2.1912 1.7039
quadrupole: 9.3914 0.8684 -10.2599 1.3393 -2.1912 1.7039
hfenergy: -897.1895682 hartree
pointgroup: C01 [X(C7H16N1O3P1)]
dipole: -0.0860018 0.8346731 -1.5719623 debye
polarizability: 148.8794631|-0.1651926|116.2002789|8.8980846|-1.9670124|93.1637206 unknown
InChI: InChI=1S/C7H16NO3P/c1-4-7-8-12(9,10-5-2)11-6-3/h4,8H,1,5-7H2,2-3H3
charge 0 multiplicity 1
28 atoms
P  0.495753 -0.435951 0.302398
O  0.870464 1.237697 0.639435
O  1.571284 -0.807346 -1.015793
O  0.547158 -1.257408 1.659519
N  -0.968913 -0.559838 -0.584622
C  -2.240386 -1.003882 0.028094
C  0.661983 2.259949 -0.421503
C  3.042597 -0.712188 -0.783127
C  0.893031 3.615727 0.242346
C  3.573153 -1.915933 0.001927
C  -3.355197 -0.007866 -0.221895
C  -4.528737 -0.312335 -0.830048
H  -0.918268 -0.517578 -1.60398
H  -2.056621 -1.118768 1.11424
H  -2.526325 -2.002958 -0.355525
H  1.376769 2.08297 -1.249617
H  -0.369629 2.170767 -0.817497
H  3.457318 -0.674238 -1.804514
H  3.270056 0.240069 -0.264091
H  0.753892 4.429118 -0.494148
H  0.182011 3.764825 1.072228
H  1.91667 3.680623 0.648505
H  4.673768 -1.847511 0.09344
H  3.137571 -1.950591 1.015245
H  3.325345 -2.857719 -0.517016
H  -3.1612 1.016284 0.129089
H  -5.31371 0.437862 -0.976214
H  -4.741337 -1.326682 -1.191473
