program: Gaussian 09
title: 000234435
version: EM64L-G09RevD.01
frameworkgroup: C1[X(C12H18NO)]
method: RPBEPBE
basis: SDD
operation: Freq
keyword: #p
keyword: freq=noraman
keyword: PBEPBE/SDD
title: #p freq=noraman PBEPBE/SDD
converged: YES YES NO NO
title: Mulliken charges:
elementType: O N C C C C C C C C C C C C H H H H H H H H H H H H H H H H H H
charge: -0.157263 -0.054916 -0.366319 -0.338971 -0.523992 -0.356684 0.238666 -0.509054 -0.684889 -0.066254 -0.123157 -0.187005 -0.171230 -0.134760 0.215609 0.235931 0.191764 0.191959 0.256212 0.265838 0.202782 0.200783 0.300761 0.269688 0.211770 0.212397 0.231407 0.307083 0.283679 0.283865 0.282140 0.292158
chargesum: 1.00000
title: Mulliken charges with hydrogens summed into heavy atoms:
elementType: O N C C C C C C C C C C C C
charge: -0.157263 -0.054916 0.085222 0.044752 -0.001943 0.046881 0.238666 0.061394 -0.029315 0.240830 0.160522 0.096861 0.110911 0.157398
polarizability: 2.07071703e+02 7.80932971e+00 1.24431883e+02 -1.56441012e+01 4.26255700e+00 9.50988995e+01
1716.lowfreq: -38.4821 -9.1260 -0.0003 0.0001 0.0010 3.4289 16.6720 17.6971 44.7394
frequency: -26.5634 16.0657 44.7367 66.0284 75.1415 101.6132 107.6915 120.1039 204.2031 216.8754 229.0040 266.8798 357.2968 381.2889 399.8745 419.8592 449.3304 463.9461 562.6358 640.7247 669.3604 697.1983 715.3132 735.4008 765.7277 796.9666 817.2022 842.1402 848.1357 894.5767 903.9894 937.2304 961.1711 979.4067 998.2632 1015.2671 1022.1345 1043.5965 1048.9793 1065.5850 1079.6181 1081.6282 1111.7157 1121.4799 1172.8252 1182.2402 1191.6425 1212.0245 1224.5026 1239.8562 1254.4448 1281.5305 1285.3655 1290.5473 1308.1458 1345.8709 1352.6409 1356.3535 1375.0123 1394.6391 1415.2983 1446.0920 1463.0975 1468.1712 1477.4088 1478.4748 1479.4201 1484.1779 1486.6198 1568.6206 1626.6359 1649.1531 2938.6133 2955.9135 2973.1575 2979.3945 2990.6799 2995.1642 3000.1714 3022.4592 3029.2624 3063.3350 3075.0355 3083.7945 3101.9432 3178.5365 3189.6134 3198.0215 3207.2601 3224.2976
redmass: 1.6981 4.4178 4.4158 3.5302 4.7781 1.8472 3.3967 2.4641 4.1048 3.8984 1.1193 4.7506 2.6118 3.1387 2.7030 3.2620 2.3550 3.5004 5.2024 6.2320 3.3542 1.9131 1.2060 1.1982 1.7436 1.5009 4.5768 2.2804 1.2742 1.5847 2.0003 1.3331 1.3930 1.3957 3.4133 5.2773 1.3708 3.6204 2.2891 2.1107 1.7315 2.1146 1.9312 2.1560 2.7170 1.2498 1.4945 1.2925 1.1790 1.3320 1.2661 1.2606 1.1365 1.1011 1.3974 1.5081 1.5976 1.6060 2.4469 1.2100 1.0862 1.2242 1.0689 1.0737 1.0777 2.1628 1.0448 1.6828 1.0877 5.6771 5.1561 8.4629 1.0628 1.0588 1.0598 1.0363 1.0886 1.0703 1.0938 1.0629 1.1030 1.1031 1.1010 1.0991 1.1018 1.0908 1.0916 1.0963 1.1010 1.0999
irintensity: 0.1440 0.2802 0.6750 1.3235 3.4847 2.6149 5.6217 0.9313 0.7829 2.7654 0.0272 7.1481 0.4493 0.9646 0.5774 1.8822 3.7482 15.5574 2.0570 0.5253 3.8822 80.1169 7.5255 1.8331 29.4633 5.8972 2.0923 16.8837 1.2591 3.9357 4.0574 1.9835 1.2123 0.2872 15.1520 1.1268 0.4081 17.0261 2.1027 9.7057 12.7724 2.0585 12.3641 57.9543 7.1566 7.8877 1.5399 2.3320 0.5384 20.3014 3.4165 41.3595 27.1473 5.0546 19.8806 5.3115 3.1873 2.3628 5.4157 10.2706 24.1171 24.4257 2.6452 0.8666 8.8870 54.9656 16.2933 19.2168 23.1416 7.0712 25.5326 51.0074 20.4691 12.8649 40.6218 33.5036 14.4871 14.5077 6.4755 4.2086 19.4537 22.4847 86.1883 37.3994 0.3598 0.1132 0.3353 1.0072 2.1605 2.7271
temp: 298.150 k
press: 1.00000 atm
elementType: 8 7 6 6 6 6 6 6 6 6 6 6 6 6 1 1 1 1 1 1 1 1 1 1 1 1 1 1 1 1 1 1
symmnumber: 1
zpe: 723698.0 jmol-1
zpe.correction: 0.275642 hartree
zpe.thermalcorrener: 0.289766 hartree
zpe.thermalcorrenthalpy: 0.290710 hartree
zpe.thermalcorrgfe: 0.232471 hartree
zpe.sumelectzpe: -596.737624 hartree
zpe.sumelectthermal: -596.723500 hartree
zpe.sumelectthermalent: -596.722556 hartree
zpe.sumelectthermalfe: -596.780794 hartree
dipole: 10.4774 -2.7688 1.7054
dipole: 10.9705
quadrupole: -16.7398 -71.9177 -78.2450
quadrupole: 0.9682 -4.6925 4.0390
quadrupole: 38.8944 -16.2835 -22.6109 0.9682 -4.6925 4.0390
hfenergy: -597.0132657 hartree
pointgroup: C01 [X(C12H18N1O1)]
dipole: 4.1136668 0.2934673 -1.2729598 debye
polarizability: 206.9242161|8.0770644|112.5405127|16.1716757|-14.8079202|107.1377571 unknown
InChI: InChI=1S/C12H18NO/c1-2-3-5-8-12(14)11-13-9-6-4-7-10-13/h4,6-7,9-10H,2-3,5,8,11H2,1H3
charge 1 multiplicity 1
32 atoms
O  0.003706 -0.426544 1.038472
N  2.194618 -0.045495 -0.625099
C  -2.81764 -0.281128 0.263327
C  -4.198147 0.162079 -0.270955
C  -1.668676 0.177069 -0.661377
C  -5.362625 -0.31058 0.630033
C  -0.282436 -0.147647 -0.147859
C  0.847795 -0.146997 -1.238777
C  -6.742115 0.137016 0.102136
C  2.620663 -1.06342 0.20172
C  2.947309 1.10014 -0.781759
C  3.847151 -0.961156 0.876076
C  4.174326 1.239966 -0.124401
C  4.636743 0.198671 0.718105
H  -2.792284 -1.383822 0.362936
H  -2.655588 0.127474 1.27803
H  -4.350843 -0.23318 -1.297003
H  -4.228328 1.268868 -0.352771
H  -1.78723 -0.237353 -1.685112
H  -1.714962 1.282623 -0.79249
H  -5.212643 0.080978 1.656237
H  -5.337173 -1.416135 0.710492
H  0.769583 -1.092165 -1.807925
H  0.698998 0.683435 -1.947692
H  -6.932873 -0.265862 -0.91012
H  -6.809942 1.239442 0.044724
H  -7.555005 -0.214869 0.761673
H  1.97327 -1.936017 0.287077
H  2.541318 1.87108 -1.439858
H  4.166431 -1.784957 1.518075
H  4.754725 2.153287 -0.272523
H  5.593975 0.292898 1.238405
