program: Gaussian 09
title: 000232773
version: EM64L-G09RevD.01
frameworkgroup: C1[X(C6H12N2O2)]
method: RPBEPBE
basis: SDD
operation: Freq
keyword: #p
keyword: freq=noraman
keyword: PBEPBE/SDD
title: #p freq=noraman PBEPBE/SDD
converged: YES YES NO NO
title: Mulliken charges:
elementType: O O N N C C C C C C H H H H H H H H H H H H
charge: -0.302746 -0.441227 -0.097465 -0.378110 -0.409755 -0.423807 -0.392169 -0.524403 0.282794 -0.296152 0.240270 0.217452 0.222109 0.240058 0.216824 0.233406 0.241297 0.230380 0.312959 0.234176 0.218421 0.375690
chargesum: 0.00000
title: Mulliken charges with hydrogens summed into heavy atoms:
elementType: O O N N C C C C C C
charge: -0.302746 -0.065537 -0.097465 -0.065151 0.047967 0.038359 0.058061 -0.052726 0.282794 0.156446
polarizability: 1.10221506e+02 -4.34352169e+00 7.49805093e+01 -7.82613844e-01 -1.22523159e+00 6.89641570e+01
1716.lowfreq: -21.2179 -7.1041 0.0002 0.0004 0.0009 4.2985 24.3310 46.9049 65.4957
frequency: 23.4362 46.4668 65.4575 107.4420 113.4064 157.1345 236.6095 262.7072 333.2522 382.3013 430.1425 505.1461 525.2212 577.2859 608.3793 690.8229 746.4385 790.6423 814.4140 824.9430 876.0915 963.8921 969.0889 986.0275 1011.7331 1036.9954 1058.0854 1062.9491 1077.5726 1083.9719 1119.4169 1141.9366 1186.4002 1216.4535 1245.5565 1261.5761 1281.9545 1314.6110 1336.1599 1365.5729 1399.8284 1445.9336 1451.2843 1453.5763 1467.2779 1472.7036 1482.7697 1594.5672 2924.3509 2993.0306 3001.3127 3033.6264 3052.6601 3062.9029 3063.8422 3115.4660 3164.7376 3182.0886 3506.6116 3556.1191
redmass: 4.2881 3.3269 4.7607 3.2388 3.4089 3.5674 2.8787 3.5207 3.2795 2.5066 3.1738 2.0909 1.3085 1.4807 3.1697 4.0750 2.9860 1.3682 2.9012 1.4673 2.9647 3.7281 1.4464 1.7879 3.5690 1.7644 1.8612 1.2758 1.8646 1.8191 1.6129 1.4563 1.5227 1.3138 1.4585 2.9233 1.2111 1.4454 1.1824 1.4241 1.1581 1.0921 1.1576 1.0840 1.1465 1.9639 1.1108 5.8910 1.0669 1.0604 1.0660 1.0926 1.0511 1.0710 1.0918 1.1001 1.1144 1.1153 1.0650 1.0790
irintensity: 3.5352 5.8035 4.2855 2.8305 8.9015 8.7909 4.1100 5.7885 15.6944 4.4368 3.9102 18.0781 89.8785 214.5520 6.9821 13.6493 6.2925 3.1244 7.4275 2.7957 10.6196 148.4164 29.5079 18.0872 60.6720 25.3676 12.6349 7.5717 8.1192 4.8666 13.1678 0.3844 32.0200 23.2083 39.1860 16.8106 3.1839 21.1284 29.2827 39.5504 59.3217 9.3778 22.3953 8.4920 3.2977 243.3921 10.8650 128.1304 37.0719 11.1886 56.4967 15.0155 28.5097 50.4360 15.6606 23.7597 1.9255 41.7031 14.3356 22.8797
temp: 298.150 k
press: 1.00000 atm
elementType: 8 8 7 7 6 6 6 6 6 6 1 1 1 1 1 1 1 1 1 1 1 1
symmnumber: 1
zpe: 480075.7 jmol-1
zpe.correction: 0.182851 hartree
zpe.thermalcorrener: 0.193990 hartree
zpe.thermalcorrenthalpy: 0.194934 hartree
zpe.thermalcorrgfe: 0.144089 hartree
zpe.sumelectzpe: -494.928483 hartree
zpe.sumelectthermal: -494.917344 hartree
zpe.sumelectthermalent: -494.916400 hartree
zpe.sumelectthermalfe: -494.967245 hartree
dipole: -1.5129 -1.9751 -0.2339
dipole: 2.4990
quadrupole: -65.2382 -59.8233 -59.7428
quadrupole: -10.9553 -4.0431 0.1371
quadrupole: -3.6368 1.7781 1.8586 -10.9553 -4.0431 0.1371
hfenergy: -495.1113339 hartree
pointgroup: C01 [X(C6H12N2O2)]
dipole: -0.608691 -0.2342824 -0.7356746 debye
dipolederiv: -0.7475173 -0.0888948 -0.0764511 0.0514882 -0.6104336 -0.3121262 0.0751526 -0.2657338 -0.7138935 -0.7018942 -0.170175 -0.1153248 -0.1094442 -0.4463263 0.1281149 -0.3758634 0.115874 -0.6650845 -0.7487964 -0.0681272 0.1734939 -0.057145 -0.1447088 -0.1094028 0.2134566 -0.1089129 -0.3460728 -1.275192 0.1513927 0.201933 0.0120202 -0.3939639 0.0126426 0.2737815 -0.0132425 -0.7290675 0.1560415 0.0366664 0.045008 0.0574033 0.0324223 0.0787764 0.0245994 0.0985053 0.1486308 0.1196699 0.0984755 -0.0238078 0.0990021 0.1000949 0.1009366 -0.0311515 0.0919867 0.0727982 0.6580257 0.0768791 -0.0472782 -0.0174991 0.1653489 -0.0260382 -0.0450299 0.0040374 0.2395903 -0.4699632 -0.0324649 0.0018962 -0.0886645 -0.0157385 -0.0044376 -0.0198843 -0.0332148 0.1275163 1.3879447 -0.0297535 -0.2886025 -0.0111832 0.5515838 0.4872688 -0.4176858 0.4501602 0.8344165 1.0231186 0.0499806 0.1180845 0.1866597 0.4737246 -0.1022182 0.3731869 -0.1275966 0.7138116 -0.1094072 0.0372337 -0.0865832 0.0328988 0.0576591 -0.0179988 -0.11634 0.001881 0.0499368 0.0303762 -0.0352023 -0.0496178 0.0379795 -0.1071391 -0.0863266 0.0148167 -0.1121826 0.0558868 0.0471613 -0.0489202 -0.1075314 -0.0469678 0.058423 -0.0373271 -0.0555794 0.0226833 -0.1104347 0.0469638 -0.088307 -0.0016086 -0.1272297 -0.0780518 0.049677 0.0047294 0.0168979 0.0548384 -0.0167229 -0.0055502 0.0297092 -0.0371762 -0.0176232 -0.0781256 -0.0520302 -0.1380172 -0.0983715 -0.0065213 -0.0174255 0.0342062 -0.0374353 -0.0340868 0.1084048 0.0325098 0.1200379 -0.038372 0.0748931 -0.0433899 0.0120452 -0.0290404 0.00488 0.06746 0.0025334 0.0997281 -0.0129152 0.0487675 0.0061999 0.0198565 0.0215355 0.026583 -0.0892064 0.0193713 -0.1112551 -0.0734711 0.1291507 -0.053914 0.0013117 -0.0571127 0.1918135 -0.1237454 -0.0481717 -0.0831603 0.2556124 -0.0000856 0.0541642 -0.0374958 -0.0475417 -0.1463531 0.0996185 -0.0800815 0.0383038 0.0204942 -0.0237599 0.0285014 0.0611001 0.0593072 0.0679103 -0.0873878 0.0737229 -0.0314801 -0.0526115 0.377747 0.1426309 0.1356566 0.1081452 0.2639818 -0.0585588 0.1339573 -0.0352997 0.2667622 unknown
polarizability: 110.0598942|-1.3843777|70.9527398|-4.8202378|3.1351003|73.1535387 unknown
InChI: InChI=1S/C6H12N2O2/c9-5-7-6(10)1-2-8-3-4-8/h7,9H,1-5H2
charge 0 multiplicity 1
22 atoms
O  1.344199 0.798073 0.94137
O  4.04607 -0.323591 0.761259
N  -2.661279 -0.236904 -0.45371
N  2.180673 -0.453994 -0.809736
C  -3.858761 0.526798 0.052814
C  -3.354052 -0.692882 0.810445
C  -1.344348 0.428292 -0.254173
C  -0.234791 -0.643746 -0.279915
C  1.136949 -0.040104 0.001592
C  3.537216 0.06047 -0.544192
H  -4.757438 0.457437 -0.567539
H  -3.689405 1.507944 0.518447
H  -2.850453 -0.510617 1.770751
H  -3.886471 -1.646118 0.73732
H  -1.272288 0.999214 0.700188
H  -1.200392 1.141495 -1.087129
H  -0.449731 -1.39166 0.508889
H  -0.258082 -1.173377 -1.24967
H  2.042772 -1.224387 -1.465785
H  3.507439 1.163058 -0.642033
H  4.226817 -0.372935 -1.283481
H  3.490456 0.156532 1.432984
