program: Gaussian 09
title: 000234422
version: EM64L-G09RevD.01
frameworkgroup: C1[X(C17H13ClN2O)]
method: RPBEPBE
basis: SDD
operation: Freq
keyword: #p
keyword: freq=noraman
keyword: PBEPBE/SDD
title: #p freq=noraman PBEPBE/SDD
converged: YES YES NO NO
title: Mulliken charges:
elementType: Cl O N N C C C C C C C C C C C C C C C C C H H H H H H H H H H H H H
charge: -0.058047 -0.254746 -0.427409 -0.000981 0.387201 0.006790 0.499982 -0.594249 0.017363 -0.340060 -0.359471 0.041568 -0.294289 -0.808051 0.579706 -0.284401 -0.317608 -0.372129 -0.237433 -0.250216 -0.226345 0.238778 0.333728 0.262769 0.237806 0.266816 0.226106 0.236616 0.236806 0.285145 0.239697 0.257050 0.234355 0.237151
chargesum: 0.00000
title: Mulliken charges with hydrogens summed into heavy atoms:
elementType: Cl O N N C C C C C C C C C C C C C C C C C
charge: -0.058047 -0.254746 -0.093682 -0.000981 0.387201 0.006790 0.499982 -0.355471 0.017363 -0.077291 -0.121665 0.041568 -0.027473 -0.108522 0.579706 0.000744 -0.317608 -0.132432 0.019617 -0.015861 0.010806
polarizability: 5.16264629e+02 -3.90779807e+01 2.37867031e+02 5.52395872e-02 8.56978859e-02 8.30553540e+01
1716.lowfreq: -6.8896 -0.0018 -0.0011 0.0016 1.1787 3.9556 13.4837 34.6807 41.7468
frequency: 13.3552 34.6391 41.7410 53.0597 79.4591 102.8990 135.5351 142.2879 163.5111 169.7690 213.7599 239.3423 259.1050 281.6609 318.1607 364.7579 380.4901 381.9630 422.2146 436.5044 458.4356 461.0752 474.6869 482.4882 532.0400 556.2526 591.7415 593.3103 609.3398 659.0033 685.4821 709.4997 734.5754 735.7627 753.0354 761.5768 787.2595 794.6925 829.6451 831.0705 865.4307 872.2215 917.9897 922.8469 947.4382 950.6512 970.9653 985.7043 1005.2552 1014.5890 1018.0952 1040.8882 1045.4012 1111.7810 1120.6171 1135.3130 1171.5758 1181.2902 1216.4387 1232.7059 1252.5688 1281.7805 1285.2931 1294.1797 1301.3869 1332.0013 1362.7262 1381.1763 1395.6869 1401.3498 1427.6174 1442.3876 1463.0706 1468.0760 1477.9185 1494.1720 1500.7146 1562.0245 1565.5426 1599.4223 1615.8661 1623.9638 1633.7994 2979.2831 3057.3011 3089.1915 3119.9185 3131.4114 3135.9761 3137.7469 3146.4489 3152.3701 3164.9282 3169.5357 3177.1360 3504.0631
redmass: 7.4924 4.6076 7.0374 1.0567 4.2686 5.9438 4.2990 8.4716 3.5238 7.6379 3.3931 4.3117 4.4620 3.7046 7.4681 4.9663 6.0743 4.2136 6.9090 3.4581 3.6575 6.9035 3.3797 5.4320 3.6694 6.4568 8.0989 3.4587 6.0333 6.1807 6.2835 2.5927 1.9558 6.5107 2.3450 1.3371 5.8958 4.3417 4.9879 1.3972 1.4030 1.5326 2.0545 4.5545 2.8611 1.3877 1.3355 1.3425 1.5646 6.9004 1.1194 2.0926 1.5615 3.9529 1.8015 1.3982 1.0839 1.8204 1.5146 2.9820 2.0827 2.2138 1.8579 2.6232 1.3796 2.8592 2.1579 4.1833 2.7997 1.5696 2.3838 3.4463 2.4242 1.0454 1.3429 5.3785 3.3891 5.6502 6.4342 6.5619 5.0019 6.2015 6.2210 1.0375 1.0973 1.0989 1.0918 1.0921 1.0892 1.0856 1.0877 1.0895 1.0952 1.0961 1.1000 1.0768
irintensity: 1.0411 2.1574 1.2986 0.2211 0.0597 1.4445 0.0053 0.5333 0.1142 0.3163 0.0223 0.5751 5.5225 2.4093 2.7161 4.5272 7.0733 1.7200 3.6470 8.1527 10.1077 3.4146 2.8971 24.5078 0.4839 17.1776 15.2417 2.4675 1.9516 3.8766 10.7939 11.3902 3.7633 5.0544 27.6960 116.7676 1.2747 14.1105 0.9432 62.8884 0.0207 17.3797 1.4830 6.6593 1.8707 0.3391 1.1787 1.6298 9.5953 46.7997 52.7154 3.1741 15.0913 31.0722 1.3490 17.2452 4.4225 2.7269 10.0774 0.2769 1.2459 7.0128 10.5962 8.8864 41.1857 29.4584 5.7981 21.3725 0.8530 10.9528 30.8431 1.0031 22.7291 14.1693 40.8266 38.4761 35.6100 6.0580 35.9488 2.8444 352.8126 34.0060 167.1900 38.5425 16.4918 18.7020 24.3764 0.2531 16.9658 3.7369 27.0669 0.9152 14.1708 7.8107 24.7903 37.1251
temp: 298.150 k
press: 1.00000 atm
elementType: 17 8 7 7 6 6 6 6 6 6 6 6 6 6 6 6 6 6 6 6 6 1 1 1 1 1 1 1 1 1 1 1 1 1
symmnumber: 1
zpe: 670688.9 jmol-1
zpe.correction: 0.255452 hartree
zpe.thermalcorrener: 0.273487 hartree
zpe.thermalcorrenthalpy: 0.274432 hartree
zpe.thermalcorrgfe: 0.206784 hartree
zpe.sumelectzpe: -1298.971126 hartree
zpe.sumelectthermal: -1298.953090 hartree
zpe.sumelectthermalent: -1298.952146 hartree
zpe.sumelectthermalfe: -1299.019794 hartree
dipole: 2.9116 -0.3421 0.0115
dipole: 2.9316
quadrupole: -78.2213 -131.0971 -134.5626
quadrupole: -5.4141 0.0628 0.0142
quadrupole: 36.4057 -16.4701 -19.9356 -5.4141 0.0628 0.0142
hfenergy: -1299.2265778 hartree
pointgroup: C01 [X(C17H13Cl1N2O1)]
dipole: 1.1513694 -0.0492 0.0474099 debye
polarizability: 519.8820259|-16.9983461|214.0818889|15.5548177|-51.1717924|103.2230988 unknown
InChI: InChI=1S/C17H13ClN2O/c1-11-6-8-14-16(10-11)20-17(21)15(19-14)9-7-12-4-2-3-5-13(12)18/h2-10,20H,1H3
charge 0 multiplicity 1
34 atoms
Cl -3.328004 -2.9343 0.897239
O  0.589445 2.908615 -1.29656
N  2.527214 1.71573 -0.790865
N  0.992637 -0.489206 0.020605
C  3.199604 0.575436 -0.337398
C  2.385102 -0.535302 0.069579
C  5.243597 -0.671582 0.188656
C  4.612491 0.501179 -0.27551
C  0.379934 0.619524 -0.41876
C  3.036435 -1.712329 0.535364
C  4.434219 -1.77945 0.593463
C  1.127739 1.840891 -0.872296
C  -1.076186 0.707269 -0.483469
C  6.75546 -0.768103 0.262418
C  -3.372595 -0.295487 -0.136438
C  -1.907551 -0.315635 -0.099987
C  -4.149139 -1.414676 0.286596
C  -4.113411 0.839937 -0.594945
C  -5.555833 -1.425942 0.263979
C  -5.5181 0.851251 -0.62635
C  -6.247679 -0.284133 -0.196077
H  5.218248 1.360229 -0.590292
H  3.061059 2.537221 -1.094031
H  2.404935 -2.551482 0.842166
H  4.922434 -2.691992 0.953872
H  -1.45134 1.663601 -0.864158
H  7.244711 0.157262 -0.085569
H  7.131173 -1.603897 -0.357243
H  7.091195 -0.959314 1.299029
H  -1.430052 -1.23164 0.268641
H  -3.563358 1.724671 -0.930574
H  -6.099387 -2.313113 0.600949
H  -6.047701 1.740176 -0.984402
H  -7.342395 -0.285011 -0.216636
