program: Gaussian 09
title: 000234397
version: EM64L-G09RevD.01
frameworkgroup: C1[X(C8H7ClO2S)]
method: RPBEPBE
basis: SDD
operation: Freq
keyword: #p
keyword: freq=noraman
keyword: PBEPBE/SDD
title: #p freq=noraman PBEPBE/SDD
converged: YES YES NO NO
title: Mulliken charges:
elementType: Cl S O O C C C C C C C C H H H H H H H
charge: -0.051435 -0.022710 -0.262077 -0.258881 0.196676 0.200822 0.650272 -0.451471 -0.328740 -0.308838 -0.202502 -0.850223 0.270261 0.281111 0.239123 0.244756 0.284551 0.271830 0.097474
chargesum: 0.00000
title: Mulliken charges with hydrogens summed into heavy atoms:
elementType: Cl S O O C C C C C C C C
charge: -0.051435 0.074765 -0.262077 -0.258881 0.196676 0.200822 0.650272 -0.181209 -0.047630 -0.308838 0.281377 -0.293841
polarizability: 1.74093958e+02 1.07325575e+00 1.13844888e+02 5.47068006e+00 -3.68962505e+00 6.83591419e+01
1716.lowfreq: -7.7477 -6.6391 -0.0036 -0.0031 -0.0012 4.1929 29.8824 57.0326 78.8156
frequency: 29.8077 56.9249 78.8013 118.3696 128.7673 189.6649 230.8529 270.2943 290.9252 348.4271 356.7688 421.0584 450.9849 516.4472 595.9361 661.1010 672.2915 681.6908 716.0177 729.0367 791.0373 831.9452 852.1565 856.8808 886.3248 899.3891 956.0905 976.2750 1067.2360 1074.0235 1120.6333 1125.3689 1170.1315 1232.0114 1256.3846 1261.9756 1360.2193 1384.5165 1421.5170 1459.2985 1465.0234 1483.9624 1607.3363 1625.3041 2418.1273 3009.4455 3044.6020 3111.3977 3123.0753 3173.9072 3195.9909
redmass: 7.3602 2.5481 6.3009 10.2764 1.0930 10.9178 8.6098 6.5417 3.0520 10.9361 8.7408 3.6552 4.5072 4.1367 8.8687 6.8563 5.6317 9.2797 3.0911 5.4767 5.0918 3.8698 1.6111 1.5022 1.6322 1.5226 4.4422 4.2163 1.4941 3.5073 1.2407 1.0544 1.7279 1.3020 1.2358 6.2702 1.3755 3.5939 6.1881 1.1587 2.5227 1.3052 8.6099 9.1683 1.0384 1.0590 1.0580 1.1128 1.1078 1.0933 1.0940
irintensity: 0.1072 15.2548 0.8579 0.9065 31.3271 2.1952 0.4792 0.8977 3.4696 0.9161 0.4515 10.4342 9.0491 8.9043 13.4869 11.0585 7.8050 3.9640 0.8370 1.4830 17.3937 24.1669 12.1076 28.4785 25.1598 7.3897 74.8528 92.7366 6.2351 46.8299 21.0990 0.7519 21.4396 6.6310 30.0109 155.2209 2.0367 42.7114 7.8364 13.3741 200.0242 35.0260 3.8543 8.9575 49.5563 115.1516 21.7764 27.8507 2.1992 0.6630 0.9746
temp: 298.150 k
press: 1.00000 atm
elementType: 17 16 8 8 6 6 6 6 6 6 6 6 1 1 1 1 1 1 1
symmnumber: 1
zpe: 339654.2 jmol-1
zpe.correction: 0.129367 hartree
zpe.thermalcorrener: 0.140944 hartree
zpe.thermalcorrenthalpy: 0.141888 hartree
zpe.thermalcorrgfe: 0.089765 hartree
zpe.sumelectzpe: -1316.704950 hartree
zpe.sumelectthermal: -1316.693373 hartree
zpe.sumelectthermalent: -1316.692429 hartree
zpe.sumelectthermalfe: -1316.744552 hartree
dipole: -1.4785 -0.8971 1.2660
dipole: 2.1432
quadrupole: -70.2079 -86.9418 -85.0340
quadrupole: -1.3636 7.0679 -2.2177
quadrupole: 10.5200 -6.2140 -4.3061 -1.3636 7.0679 -2.2177
hfenergy: -1316.8343174 hartree
pointgroup: C01 [X(C8H7Cl1O2S1)]
dipole: 0.5702657 -0.3910919 -0.482554 debye
dipolederiv: -0.4646362 0.3173604 -0.0152995 0.3101704 -0.4183919 -0.0023583 -0.0085619 -0.0096617 -0.0599232 -0.1187722 -0.018801 0.2145952 -0.0150163 -0.2564998 0.0322323 0.2161763 0.0264146 -0.044934 -1.3866807 0.2101661 -0.1070207 0.3250537 -0.4712939 -0.0148163 -0.0598349 -0.0237669 -0.2734109 -1.517154 0.0568822 -0.1052218 0.0232264 -0.4392579 -0.0016086 -0.1106705 -0.0039752 -0.2687527 0.8141153 -0.3322598 0.0149454 -0.922052 0.1617303 -0.0522265 -0.083247 -0.0176302 0.0382979 1.1801106 0.0359274 0.0797011 0.520609 0.0297136 0.053065 0.1532352 0.0078653 0.0580794 -0.140824 0.0760154 -0.0600847 0.1719086 -0.1375955 0.0282 0.0092408 0.0077382 -0.077306 -0.0146308 0.0752475 0.0286399 -0.0121808 0.0387285 0.0240473 -0.011818 0.0141592 -0.14163 -0.3161413 0.0261002 0.0067533 0.1628764 -0.0790874 0.0169256 0.0048794 0.0097074 -0.1041946 0.5831693 -0.4197312 0.0282191 -0.4803242 0.6023322 -0.0017454 -0.0125562 0.0387526 -0.0843245 1.1931165 -0.0983198 0.1222893 -0.1535504 0.5487864 -0.0212013 0.1699435 -0.0339745 0.6054907 0.3194276 0.2085078 -0.2078332 0.1483465 0.18155 -0.1144313 -0.1658225 -0.086579 0.2719995 0.098821 -0.0112847 -0.0210356 -0.0102671 -0.015405 -0.025818 -0.0124095 -0.0235164 0.1585052 0.0988657 -0.0149637 -0.0087125 -0.0220122 0.0244569 -0.0217757 -0.0168222 -0.0253214 0.1805247 -0.0415829 0.018339 -0.039461 0.0488896 0.0441846 0.0336614 -0.1846744 0.0528464 -0.131149 -0.1282204 0.0195738 0.0513861 0.0164741 0.0757913 0.0039923 0.1145778 -0.0044111 0.0019495 -0.0128313 -0.0029681 0.0094703 0.0632091 0.0271665 0.103892 0.0327804 0.0862655 -0.0077237 0.021472 -0.0188421 0.0666689 -0.0641236 -0.0297943 -0.0729576 0.0571638 -0.0382104 -0.090911 -0.1676241 -0.1269492 -0.0579995 -0.1112373 0.1128853 0.0329231 -0.09158 0.0232976 -0.030587 unknown
polarizability: 174.3681971|0.6134851|114.1211208|1.260668|-0.9692062|67.8086699 unknown
InChI: InChI=1S/C8H7ClO2S/c9-6-2-8-7(10-4-11-8)1-5(6)3-12/h1-2,12H,3-4H2
charge 0 multiplicity 1
19 atoms
Cl -2.412392 2.242861 -0.13765
S  -3.338457 -1.581687 1.053538
O  2.335049 -1.406001 -0.170818
O  2.696921 0.938639 0.202843
C  1.101986 -0.708062 -0.172647
C  1.318316 0.670115 0.046109
C  -1.283613 -0.325563 -0.385451
C  -0.171357 -1.226053 -0.391373
C  0.267081 1.586763 0.056248
C  -1.028397 1.050176 -0.159327
C  3.351109 -0.400484 0.239268
C  -2.668745 -0.87393 -0.606715
H  -0.332636 -2.294931 -0.554124
H  0.427498 2.653766 0.219646
H  3.673275 -0.612753 1.275303
H  4.180347 -0.411686 -0.484535
H  -3.364439 -0.089548 -0.937855
H  -2.654228 -1.70212 -1.332064
H  -4.589119 -1.932903 0.563106
