program: Gaussian 09
title: 000232758
version: EM64L-G09RevD.01
frameworkgroup: C1[X(C16H16O5)]
method: RPBEPBE
basis: SDD
operation: Freq
keyword: #pfreq=noraman
keyword: PBEPBE/SDD
title: #p freq=noraman PBEPBE/SDD
converged: YES YES NO NO
title: Mulliken charges:
elementType: O O O O O C C C C C C C C C C C C C C C C H H H H H H H H H H H H H H H H
charge: -0.467373 -0.401189 -0.263752 -0.266592 -0.235946 -0.090388 0.355350 0.413862 0.114137 -0.351793 -0.335530 -0.389795 -0.379063 -0.353200 -0.371489 -0.368833 -0.355576 0.319089 0.325077 -0.537496 -0.537749 0.282338 0.252949 0.267261 0.271224 0.366369 0.250975 0.247937 0.239247 0.239245 0.385808 0.220874 0.221086 0.246409 0.220232 0.222132 0.244162
chargesum: 0.00000
title: Mulliken charges with hydrogens summed into heavy atoms:
elementType: O O O O O C C C C C C C C C C C C C C C C
charge: -0.101004 -0.015380 -0.263752 -0.266592 -0.235946 -0.090388 0.355350 0.413862 0.114137 -0.069455 -0.082581 -0.122534 -0.107839 -0.102225 -0.123551 -0.129587 -0.116331 0.319089 0.325077 0.150874 0.148777
polarizability: 2.59928073e+02 -8.63683107e+00 1.69860182e+02 -1.04629562e+01 1.19196449e+01 1.54055286e+02
1716.lowfreq: -6.2545 -0.0006 0.0001 0.0001 4.1251 5.4783 15.7442 33.9680 34.2451
frequency: 14.7465 33.9566 34.2398 58.2471 67.0912 97.5240 104.6006 125.8586 155.4103 163.3574 176.0605 222.1650 228.2354 234.6839 254.9225 284.3826 302.5544 311.1636 348.6836 352.5944 396.7342 412.6866 414.3397 424.9018 451.4807 467.7618 499.6779 523.3671 536.1210 567.1972 585.1139 587.4233 630.9467 631.9702 645.0445 688.2189 730.0600 735.5543 769.2891 775.9514 816.5365 817.6391 833.9580 842.4542 903.5483 920.1474 957.1419 958.7455 970.3610 981.7677 987.6441 988.7136 998.9653 1004.9939 1008.6933 1072.5046 1112.0033 1113.1523 1114.8519 1122.2033 1153.8798 1155.6357 1157.5753 1174.9087 1185.6124 1197.1346 1230.9513 1232.0245 1286.6438 1299.4046 1307.0991 1350.5375 1370.9871 1375.4907 1414.3339 1418.6474 1434.8070 1436.8599 1465.7005 1466.8735 1471.8030 1473.1162 1495.3897 1497.6537 1579.7543 1584.9881 1617.9473 1618.7993 1628.6671 2958.6528 2959.3547 3046.2821 3046.7537 3123.7996 3125.4287 3144.0436 3150.7663 3151.4282 3156.3306 3164.5630 3170.7901 3175.6120 3177.9621 3475.5870 3503.6465
redmass: 3.6986 4.9530 3.6622 6.6400 6.9893 3.6637 4.1521 5.4100 4.1372 3.9858 3.5637 3.6524 1.2681 1.3040 4.0852 3.7053 4.1765 5.2631 5.5186 2.6161 6.1017 2.7481 2.9911 2.2039 4.0355 4.0838 3.3158 3.3370 2.7421 3.6948 2.0161 3.2519 6.7379 6.6857 4.9148 3.7354 3.8397 3.9543 5.9339 5.7868 1.3787 1.3371 1.5688 1.5160 4.2114 3.8552 1.4183 1.5549 1.3513 1.3750 8.1383 8.4197 4.9273 2.7266 2.9426 2.6243 1.2600 1.2611 1.3404 1.3712 2.2834 1.3773 1.3614 1.3434 1.3190 3.0293 3.2839 3.0917 1.7421 1.2905 1.3615 1.7329 5.7053 5.0474 4.0949 3.7896 1.1669 1.1727 1.0504 1.0500 1.0822 1.0760 2.3036 2.3700 7.3416 7.4610 6.4994 6.7621 8.2376 1.0330 1.0329 1.1039 1.1039 1.0994 1.0992 1.0873 1.0874 1.0877 1.0883 1.0951 1.0959 1.0958 1.0965 1.0648 1.0639
irintensity: 0.9909 0.0180 1.3811 1.4480 0.4970 4.9350 1.9868 0.7267 5.8605 2.9251 0.5278 6.1548 0.5923 2.6309 3.3071 32.3287 8.1637 10.7342 2.5262 38.5086 1.7722 22.6857 0.2748 39.0199 5.2306 3.4260 2.3370 0.2863 8.3987 19.0835 158.3473 64.6929 2.3734 4.4642 17.3454 41.8884 1.8593 3.0779 7.2248 0.5960 38.4582 24.5846 50.5882 61.0650 13.8481 16.5666 1.5997 3.5823 0.7776 1.8683 54.0767 18.3622 81.2771 57.9281 36.6000 121.7971 0.1817 0.3972 4.1255 21.8108 30.3515 7.6519 5.2768 181.0993 40.9904 7.7981 176.5637 140.7682 41.1809 2.3111 15.2842 20.9614 1.7472 40.2770 2.1310 5.2566 11.0913 13.0715 13.1017 12.9908 81.5538 52.1332 144.9428 90.3367 17.5856 6.2548 71.9504 43.6607 248.2331 81.0715 61.2514 47.8106 49.1042 27.5217 27.1325 5.3488 8.9922 4.4584 2.4524 10.1521 10.4402 5.2730 4.7368 40.2053 30.2548
temp: 298.150 k
press: 1.00000 atm
elementType: 8 8 8 8 8 6 6 6 6 6 6 6 6 6 6 6 6 6 6 6 6 1 1 1 1 1 1 1 1 1 1 1 1 1 1 1 1
symmnumber: 1
zpe: 748770.0 jmol-1
zpe.correction: 0.285191 hartree
zpe.thermalcorrener: 0.305213 hartree
zpe.thermalcorrenthalpy: 0.306157 hartree
zpe.thermalcorrgfe: 0.234945 hartree
zpe.sumelectzpe: -993.862861 hartree
zpe.sumelectthermal: -993.842839 hartree
zpe.sumelectthermalent: -993.841895 hartree
zpe.sumelectthermalfe: -993.913108 hartree
dipole: -0.0840 -0.2847 -2.7371
dipole: 2.7531
quadrupole: -92.7929 -126.4774 -114.6213
quadrupole: -5.3430 -14.4328 -2.3857
quadrupole: 18.5043 -15.1802 -3.3241 -5.3430 -14.4328 -2.3857
hfenergy: -994.1480525 hartree
pointgroup: C01 [X(C16H16O5)]
dipole: -0.0297249 0.0843226 -1.079471 debye
polarizability: 260.060096|-6.2634382|165.0540309|-11.5647444|13.8806823|158.7294142 unknown
InChI: InChI=1S/C16H16O5/c1-20-13-7-3-11(4-8-13)16(19,15(17)18)12-5-9-14(21-2)10-6-12/h3-10,17,19H,1-2H3
charge 0 multiplicity 1
37 atoms
O  -0.181292 1.672658 2.01755
O  -0.221478 2.425849 -1.564436
O  4.939197 -1.672499 0.207598
O  -4.637155 -1.917262 -0.806293
O  0.132007 3.723256 0.320777
C  -0.027155 1.270931 0.613764
C  1.321445 0.533923 0.423923
C  -1.254206 0.406634 0.257079
C  -0.028161 2.594643 -0.201078
C  1.853584 -0.164281 1.541135
C  -1.201066 -0.585367 -0.754473
C  2.024113 0.483609 -0.801866
C  -2.476352 0.625157 0.931983
C  3.052618 -0.886902 1.435452
C  -2.341635 -1.337265 -1.084142
C  3.235473 -0.236921 -0.921619
C  -3.63065 -0.124573 0.614454
C  3.751442 -0.926221 0.201894
C  -3.562644 -1.109219 -0.401559
C  5.698614 -1.745921 -1.04261
C  -5.91603 -1.736718 -0.115942
H  1.314096 -0.121378 2.491305
H  -0.262885 -0.781879 -1.28141
H  1.631998 1.004841 -1.680918
H  -2.509436 1.37033 1.731599
H  0.226741 2.576418 2.117638
H  3.468912 -1.427343 2.291098
H  -2.310409 -2.109293 -1.858859
H  3.7560 -0.250325 -1.883852
H  -4.559037 0.06198 1.162614
H  -0.218604 3.315374 -2.013055
H  6.034043 -0.74246 -1.370209
H  5.104105 -2.219581 -1.848154
H  6.573162 -2.371334 -0.811105
H  -6.309554 -0.710931 -0.256154
H  -5.823618 -1.95304 0.966298
H  -6.598884 -2.462195 -0.582031
