program: Gaussian 09
title: 000234393
version: EM64L-G09RevD.01
frameworkgroup: C1[X(C15H22O3)]
method: RPBEPBE
basis: SDD
operation: Freq
keyword: #pfreq=noraman
keyword: PBEPBE/SDD
title: #p freq=noraman PBEPBE/SDD
converged: YES YES NO NO
title: Mulliken charges:
elementType: O O O C C C C C C C C C C C C C C C H H H H H H H H H H H H H H H H H H H H H H
charge: -0.294477 -0.287130 -0.269456 0.358000 -0.053854 -0.061809 -0.429553 -0.741881 -0.589003 -0.703984 -0.705608 0.512925 -0.383425 -0.421396 -0.357255 -0.356651 0.314808 -0.538439 0.222382 0.223408 0.233322 0.226141 0.235629 0.217117 0.230595 0.235321 0.212212 0.209961 0.229683 0.233101 0.227387 0.236789 0.208779 0.234667 0.228439 0.245712 0.235994 0.219226 0.243297 0.219027
chargesum: 0.00000
title: Mulliken charges with hydrogens summed into heavy atoms:
elementType: O O O C C C C C C C C C C C C C C C
charge: -0.294477 -0.287130 -0.269456 0.358000 0.168528 0.161599 0.029910 -0.058540 -0.141469 -0.031239 -0.032653 0.512925 -0.148758 -0.192957 -0.111543 -0.120657 0.314808 0.143111
polarizability: 2.35783882e+02 -1.55011861e-01 1.64995423e+02 1.24491138e+01 -4.47545108e+00 1.17678810e+02
1716.lowfreq: -20.0651 -6.8544 -0.0004 0.0002 0.0006 4.8038 15.4493 22.6942 31.1979
frequency: 5.0414 22.0347 30.9519 58.7528 67.3377 99.2651 107.4031 155.2708 166.2434 201.0518 214.5493 217.9347 230.7001 236.4211 248.1636 256.5162 312.5006 320.6770 346.5204 352.6650 384.9641 413.5224 424.6826 437.2823 483.8571 497.6208 517.1493 544.1265 633.0427 638.5726 692.6236 711.2784 716.9992 743.3223 761.8847 785.5064 794.6369 811.4725 822.0205 839.3990 860.2847 880.5137 933.7020 950.8093 962.4762 980.2986 989.0919 990.3310 1003.7297 1019.2538 1030.6560 1052.6975 1073.7370 1087.8113 1100.4201 1112.5944 1115.5292 1125.5171 1141.1206 1155.6810 1178.5670 1203.9994 1217.0693 1225.3470 1229.5724 1265.9864 1273.0340 1284.6855 1290.0467 1308.1126 1320.4417 1338.7195 1357.6412 1380.6009 1381.1589 1383.1651 1387.4919 1416.6048 1436.2670 1448.4094 1459.5226 1463.2387 1465.6416 1466.3380 1468.7267 1473.1147 1474.1103 1476.1973 1485.5541 1502.3871 1585.4427 1624.2198 2955.2847 2981.5305 2982.2876 2990.1788 3001.0122 3003.9835 3026.7542 3028.1480 3041.4438 3042.6030 3072.0617 3076.6813 3079.0021 3096.1676 3098.2039 3099.7060 3113.4849 3116.2242 3120.6739 3121.8672 3158.1275 3163.6611
redmass: 3.6259 3.5963 3.8784 3.8943 3.4777 3.4921 3.0495 3.6743 2.9306 1.3008 2.0615 1.3290 1.8260 1.0408 1.6549 1.6743 3.1057 2.5108 2.8031 3.5109 3.4307 2.9444 3.8205 3.7307 3.5594 3.2610 3.3308 2.9099 6.1003 4.0508 3.1795 4.4101 5.7994 3.1352 2.0953 1.8859 2.0505 1.5609 2.0050 2.0215 3.6374 2.6203 1.4078 1.6518 1.3602 1.9904 1.3657 7.6454 2.6973 1.9276 3.4589 2.9100 1.6820 1.9617 1.8866 1.2603 1.7421 1.3787 2.2117 1.3370 1.2240 1.9963 2.0527 2.4922 4.0488 1.3871 1.4315 1.4218 1.3346 1.2863 1.2134 1.5083 1.4769 1.3375 1.2662 3.3032 1.2670 3.2391 1.1707 1.0699 1.0630 1.0483 1.0506 1.0495 1.0566 1.0744 1.0551 1.0502 1.1011 2.4842 6.9832 6.4913 1.0332 1.0363 1.0364 1.0588 1.0397 1.0572 1.0872 1.0873 1.1038 1.0999 1.1023 1.0986 1.0977 1.1009 1.1004 1.0994 1.0995 1.0894 1.0902 1.0981 1.0935 1.0951
irintensity: 0.7670 1.0801 0.3788 0.7026 0.7287 4.1398 4.4167 2.6762 0.5798 0.9546 2.4260 1.3043 0.9921 0.0245 0.6792 1.1518 0.0530 0.0973 1.8330 0.8621 1.3821 0.0819 2.5908 8.0932 22.5543 4.3811 24.2196 15.3306 0.4716 1.3852 0.3765 4.8325 3.3405 3.8639 10.4806 14.0634 9.7378 34.2770 7.8828 38.6603 12.9262 16.3974 3.3487 13.7976 0.6272 52.4688 9.9764 28.1532 10.5140 94.2988 15.9224 46.8345 11.5932 11.4876 12.2482 0.2511 69.8863 7.7339 8.7293 0.6495 53.8992 98.6593 43.1029 128.5529 63.4989 16.1477 4.9226 15.9696 18.6625 3.3528 1.0902 6.4302 5.7810 31.0972 13.1040 3.6500 45.5223 1.6137 9.4297 7.0537 5.4365 3.6611 12.3174 23.9847 7.8208 61.8708 8.0982 7.8637 8.4450 130.3062 7.0277 32.1529 72.6072 21.4091 18.1427 13.5223 24.1705 14.2622 28.0708 21.6893 52.3743 2.1594 36.7421 23.3188 68.1686 9.6677 30.9008 30.1206 34.4633 19.8428 31.4291 12.3655 18.2831 5.0233
temp: 298.150 k
press: 1.00000 atm
elementType: 8 8 8 6 6 6 6 6 6 6 6 6 6 6 6 6 6 6 1 1 1 1 1 1 1 1 1 1 1 1 1 1 1 1 1 1 1 1 1 1
symmnumber: 1
zpe: 888291.4 jmol-1
zpe.correction: 0.338332 hartree
zpe.thermalcorrener: 0.357532 hartree
zpe.thermalcorrenthalpy: 0.358477 hartree
zpe.thermalcorrgfe: 0.287890 hartree
zpe.sumelectzpe: -809.052989 hartree
zpe.sumelectthermal: -809.033789 hartree
zpe.sumelectthermalent: -809.032845 hartree
zpe.sumelectthermalfe: -809.103431 hartree
dipole: -0.5345 -0.4680 0.6551
dipole: 0.9664
quadrupole: -88.0567 -101.9638 -115.1354
quadrupole: -13.6339 5.0432 -0.3405
quadrupole: 13.6619 -0.2452 -13.4168 -13.6339 5.0432 -0.3405
hfenergy: -809.3913211 hartree
pointgroup: C01 [X(C15H22O3)]
dipole: -0.1949829 0.1973601 -0.2599795 debye
polarizability: 236.4280841|-1.9464197|165.2340642|-8.6171623|-2.9982053|116.7959669 unknown
InChI: InChI=1S/C15H22O3/c1-11-12(2)18-15(3,17-11)10-9-13-5-7-14(16-4)8-6-13/h5-8,11-12H,9-10H2,1-4H3
charge 0 multiplicity 1
40 atoms
O  -2.988599 -0.12118 0.949854
O  -3.14084 0.626889 -1.295229
O  5.347334 -1.02363 -0.18307
C  -2.425142 0.863795 -0.0129
C  -3.816056 -1.105254 0.200959
C  -4.274167 -0.304524 -1.049114
C  -0.93002 0.591826 -0.276978
C  -2.722106 2.268257 0.526505
C  -0.030942 0.737822 0.980587
C  -3.041795 -2.392206 -0.122766
C  -5.602947 0.443505 -0.861473
C  1.403332 0.313362 0.700752
C  1.796564 -1.048354 0.814737
C  2.378463 1.246708 0.276923
C  3.107807 -1.461558 0.51639
C  3.702937 0.854613 -0.029719
C  4.066795 -0.508789 0.090009
C  6.370001 -0.077489 -0.630501
H  -4.66791 -1.328383 0.868874
H  -4.317488 -0.948778 -1.946108
H  -0.586444 1.280644 -1.072345
H  -0.835178 -0.432913 -0.678443
H  -2.316675 2.383344 1.546262
H  -2.267245 3.03235 -0.127831
H  -3.810007 2.436815 0.56485
H  -0.467902 0.11895 1.787011
H  -0.047619 1.788272 1.328063
H  -3.729921 -3.163433 -0.518309
H  -2.256789 -2.211359 -0.877888
H  -2.567081 -2.791131 0.790402
H  -5.615783 1.001674 0.091287
H  -5.758151 1.156646 -1.689271
H  -6.44884 -0.270132 -0.855509
H  1.063348 -1.793139 1.149034
H  2.10395 2.305374 0.185652
H  3.414385 -2.508216 0.608265
H  4.428003 1.608515 -0.351543
H  6.080022 0.411609 -1.581378
H  7.274563 -0.683617 -0.787061
H  6.568645 0.696715 0.136724
