program: Gaussian 09
title: 000234378
version: EM64L-G09RevD.01
frameworkgroup: C1[X(C12H9BrO2)]
method: RPBEPBE
basis: SDD
operation: Freq
keyword: #p
keyword: freq=noraman
keyword: PBEPBE/SDD
title: #p freq=noraman PBEPBE/SDD
converged: YES YES NO NO
title: Mulliken charges:
elementType: Br O O C C C C C C C C C C C C H H H H H H H H H
charge: -0.002672 -0.413666 -0.210613 0.458044 0.616327 0.405417 -0.591921 -0.414194 -0.452019 -0.693975 -0.376431 -0.420083 -0.246358 -0.243352 0.213236 0.236676 0.290695 0.266685 0.241207 0.249898 0.243292 0.232957 0.232068 0.378781
chargesum: 0.00000
title: Mulliken charges with hydrogens summed into heavy atoms:
elementType: Br O O C C C C C C C C C C C C
charge: -0.002672 -0.034885 -0.210613 0.458044 0.616327 0.405417 -0.591921 -0.177519 -0.210812 -0.136595 -0.126533 -0.176790 -0.013400 -0.011284 0.213236
polarizability: 2.17235871e+02 8.23765909e-01 1.63208656e+02 1.81346374e+01 -1.01542949e+01 7.81723697e+01
1716.lowfreq: -0.0005 -0.0002 0.0002 0.8611 3.4292 9.7189 26.4526 31.7589 48.3328
frequency: 26.2410 31.7000 48.3006 94.1757 146.0112 176.4866 209.4323 236.6573 305.5595 311.0580 334.3421 413.4404 446.0695 479.0908 507.1713 517.9342 520.3105 538.3855 590.4736 638.0268 638.9989 667.1162 743.6218 765.5133 791.7337 796.7446 823.3679 865.1902 888.5038 891.9387 935.7348 960.4830 976.6583 982.2329 996.3365 1032.6957 1042.9718 1132.2429 1158.9941 1174.8821 1182.3069 1228.1178 1237.3537 1251.8645 1276.5777 1329.0720 1339.4284 1401.3131 1404.7781 1421.6173 1441.8739 1463.9544 1507.3175 1565.5683 1606.3128 1633.5504 1676.5004 3007.9179 3069.6932 3125.3239 3127.2488 3139.5576 3150.9270 3156.6378 3170.8478 3515.8656
redmass: 7.0603 13.0172 6.9270 5.3776 5.6915 8.8707 4.1962 5.1939 5.3164 4.8814 5.1901 3.1860 2.8068 2.8141 3.3678 4.6783 5.6808 3.3311 4.2470 1.4519 5.6873 4.4079 2.5065 1.6681 3.2222 5.5127 1.6446 3.0524 1.7679 3.3718 3.2591 1.3638 1.4166 3.7505 1.3417 2.2460 2.5267 1.8278 1.4055 1.1180 1.1177 1.6262 1.9641 1.7189 1.9004 2.1925 1.9867 4.8839 3.6304 2.7797 1.1160 2.7434 3.5940 7.8292 6.0951 7.1175 8.5176 1.0627 1.0968 1.0868 1.0867 1.0893 1.0980 1.0947 1.0993 1.0641
irintensity: 0.3241 0.6848 0.8583 0.4270 0.3685 0.6756 4.1065 1.5109 1.7475 1.1853 2.9050 4.8727 9.9974 11.9710 6.4710 22.1149 15.3083 8.6269 12.8705 117.6281 13.6379 10.6034 10.7636 53.4199 8.4248 16.3078 52.7392 15.2925 4.2719 14.0540 9.4112 1.6498 4.6205 40.0181 0.0498 43.5308 310.6463 3.8795 1.8686 3.2461 1.8527 6.7328 4.5470 14.8974 8.0592 62.8666 37.7023 9.4884 1.1767 0.4140 35.9760 1.6100 17.3049 12.2775 1.3975 0.3880 183.8731 12.4232 0.7163 1.7198 3.9737 10.0547 22.3110 20.6378 22.3293 26.9688
temp: 298.150 k
press: 1.00000 atm
elementType: 35 8 8 6 6 6 6 6 6 6 6 6 6 6 6 1 1 1 1 1 1 1 1 1
symmnumber: 1
zpe: 462167.4 jmol-1
zpe.correction: 0.176030 hartree
zpe.thermalcorrener: 0.188983 hartree
zpe.thermalcorrenthalpy: 0.189927 hartree
zpe.thermalcorrgfe: 0.133893 hartree
zpe.sumelectzpe: -625.556020 hartree
zpe.sumelectthermal: -625.543067 hartree
zpe.sumelectthermalent: -625.542123 hartree
zpe.sumelectthermalfe: -625.598157 hartree
dipole: 0.6457 1.3201 -1.1883
dipole: 1.8899
quadrupole: -77.0268 -86.5940 -102.9870
quadrupole: -0.4888 1.4820 -4.8873
quadrupole: 11.8424 2.2753 -14.1177 -0.4888 1.4820 -4.8873
hfenergy: -625.7320503 hartree
pointgroup: C01 [X(C12H9Br1O2)]
dipole: -0.1959522 -0.5765383 -0.4266657 debye
dipolederiv: -0.1765403 -0.1947986 0.0173964 -0.2821468 -0.5756465 0.0403906 0.0178973 0.0273935 -0.039707 -1.3928915 -0.1853959 0.2484375 -0.2987438 -0.4564245 0.0725795 0.0634203 0.0527353 -0.2862445 -0.7173293 -0.0640725 -0.0119827 -0.13361 -0.2958869 0.0322752 0.1266868 0.1268778 -0.8879607 0.011002 -0.1519948 0.0067876 -0.270094 -0.3459479 0.0421886 -0.0029216 0.0134575 0.0685341 0.1791916 -0.0503572 0.0253837 0.0244276 -0.3000156 0.0100753 0.0308243 -0.0181056 -0.0209412 0.0411136 -0.1138929 -0.0034228 0.0231059 -0.0241296 -0.0077177 0.002008 0.0231246 0.0529125 0.1739414 0.3967834 -0.0586346 0.5381073 0.985794 -0.0772949 -0.0230037 -0.0320503 -0.1278943 -0.0889933 0.0150213 -0.0240194 -0.0431934 0.1169305 0.006804 0.0053294 -0.0132424 -0.1498869 -0.0414019 0.0485492 -0.0287973 -0.0206872 0.0847007 0.0095412 -0.0316181 -0.0078125 -0.149386 -0.017382 -0.109211 -0.0744859 -0.1292377 0.1035758 -0.0670134 -0.2753025 -0.0153517 -0.2008667 -0.0984157 0.0815796 -0.0095442 -0.0280181 0.0422026 0.0083102 -0.0075631 -0.0063644 -0.1435221 -0.0187144 0.0544243 -0.0241716 0.0854693 0.0694048 -0.006453 -0.0257986 -0.0067853 -0.1640626 -0.0459875 -0.1130923 -0.0245487 -0.0764849 0.1132151 0.0210495 -0.0233862 0.0297357 -0.1490665 0.078651 0.0940061 -0.0451337 0.0821737 -0.035179 -0.0111407 -0.0429335 -0.0138918 -0.1453938 1.6691093 0.3228876 -0.0938284 0.5009784 0.3070031 -0.0528379 0.0827381 -0.1285468 1.1810666 -0.0135044 0.1022544 0.0393461 0.082868 -0.0319472 -0.0120973 0.0357125 -0.0197167 0.1393705 0.0239804 -0.01379 -0.008912 -0.0545722 0.0399534 0.090932 0.009392 0.0378911 0.0727155 0.035266 0.0271284 -0.0081987 0.0977743 -0.0219067 -0.0791614 0.0096799 -0.0323831 0.0893633 0.0460631 -0.0945274 0.0144229 -0.0392657 -0.0735066 -0.001025 0.0228132 0.0105162 0.1522404 0.0998532 -0.0641 0.0091014 -0.0096386 -0.0280592 -0.0034988 0.0090879 0.0061828 0.1531855 0.0559716 -0.0254476 0.0171979 -0.0893474 -0.090966 0.0084006 0.0165666 -0.0013302 0.1528866 -0.0087185 0.0922547 0.0322684 0.1112615 -0.0301414 -0.0254519 0.0347245 -0.0234161 0.1525764 -0.1247274 -0.0421397 0.050796 -0.0388125 0.0864832 0.0049924 0.0524467 0.0059652 0.1520697 0.330463 -0.012069 -0.0454577 -0.0323138 0.3604937 -0.0038471 -0.0868003 -0.0148829 0.098011 unknown
polarizability: 216.2124902|5.44378|164.7808155|-20.1583408|1.8368879|77.6235909 unknown
InChI: InChI=1S/C12H9BrO2/c13-12-9(7-11(14)15)6-5-8-3-1-2-4-10(8)12/h1-6,14H,7H2
charge 0 multiplicity 1
24 atoms
Br 0.902274 2.472583 -0.436337
O  4.675231 0.467313 0.081001
O  3.040607 -0.130994 1.620143
C  -1.204679 0.435257 -0.10881
C  1.092633 -0.431609 -0.563161
C  -1.692117 -0.933383 -0.05461
C  0.197556 0.627941 -0.366095
C  0.570867 -1.767486 -0.49867
C  -0.775702 -2.014811 -0.252362
C  2.570728 -0.235437 -0.82915
C  -2.142726 1.500497 0.095897
C  -3.083476 -1.171705 0.197155
C  -3.491694 1.233406 0.339204
C  -3.970846 -0.112991 0.390984
C  3.388245 0.027859 0.43407
H  1.266895 -2.60136 -0.644423
H  2.762276 0.598634 -1.526103
H  2.998095 -1.140429 -1.301094
H  -1.150276 -3.043503 -0.206927
H  -1.788114 2.534699 0.061938
H  -3.437539 -2.208627 0.235607
H  -4.190359 2.062612 0.493879
H  -5.031418 -0.306586 0.583943
H  5.206439 0.618021 0.909621
