program: Gaussian 09
title: 000234425
version: EM64L-G09RevD.01
frameworkgroup: C1[X(C17H17NO5)]
method: RPBEPBE
basis: SDD
operation: Freq
keyword: #p
keyword: freq=noraman
keyword: PBEPBE/SDD
title: #p freq=noraman PBEPBE/SDD
converged: YES YES NO NO
title: Mulliken charges:
elementType: O O O O O N C C C C C C C C C C C C C C C C C H H H H H H H H H H H H H H H H H
charge: -0.196438 -0.390631 -0.241214 -0.239432 -0.252499 -0.447359 -0.431692 0.189167 0.666411 -0.043708 -0.436823 -0.377937 0.082432 0.149538 0.479284 -0.455390 -0.341920 -0.407712 0.417966 -0.811584 -0.770661 0.221631 -0.780842 0.277073 0.232951 0.234411 0.220411 0.310062 0.274870 0.303347 0.395003 0.237636 0.239598 0.236081 0.250106 0.212062 0.262641 0.260132 0.259985 0.213045
chargesum: 0.00000
title: Mulliken charges with hydrogens summed into heavy atoms:
elementType: O O O O O N C C C C C C C C C C C C C C C C C
charge: -0.196438 0.004373 -0.241214 -0.239432 -0.252499 -0.144013 -0.154620 0.189167 0.666411 -0.043708 -0.203871 -0.143526 0.082432 0.149538 0.479284 -0.234979 -0.031858 -0.132842 0.417966 -0.098269 -0.045852 0.221631 -0.047680
polarizability: 2.75535314e+02 -1.88007282e+01 2.26334118e+02 -1.66762416e+01 1.31505211e+01 1.84538160e+02
1716.lowfreq: -6.5160 -2.6885 -0.0006 -0.0003 -0.0001 3.7381 17.4143 20.5491 34.8220
frequency: 17.3118 20.5283 34.7974 44.5870 52.2995 55.1364 69.8274 77.0136 92.8618 104.4639 127.3158 137.7205 164.2066 176.8037 209.3203 214.6505 230.5341 244.4975 269.4374 273.8702 298.2634 352.7724 358.8457 381.1415 390.2017 409.2346 426.1861 434.4981 453.1712 497.2581 528.6621 535.7764 575.5976 594.7703 604.8862 628.9571 634.4285 645.0027 649.6278 719.6287 727.8830 740.6361 749.8505 794.6555 818.0665 823.7190 830.0220 845.1394 851.9408 872.8552 882.1664 932.0690 950.0215 952.9502 963.6469 980.7583 993.7942 995.7958 1009.0682 1018.7243 1039.7609 1075.9389 1080.2216 1101.2995 1128.0242 1172.5706 1192.8419 1209.7575 1217.5363 1220.4058 1237.8209 1266.2626 1276.7519 1278.4719 1322.9906 1352.4848 1381.9935 1384.9500 1389.1356 1393.7160 1400.4174 1416.2056 1446.0705 1448.6611 1449.6762 1457.9273 1465.7927 1469.6501 1495.5718 1512.6702 1513.9175 1596.2309 1622.8175 1630.4763 1631.0741 1654.3266 1689.5278 2965.1832 2984.2567 2995.8118 3038.0115 3054.0352 3064.2995 3091.8472 3097.0622 3097.1154 3099.8782 3114.8268 3135.2240 3139.3927 3147.3762 3196.0000 3424.1753 3533.3479
redmass: 4.7145 4.4506 3.6775 1.5244 3.0844 3.4091 3.6645 3.3546 4.5611 3.4741 1.6995 5.0212 2.7665 4.1467 1.4691 2.9954 6.2006 6.0925 5.8952 5.8431 5.7183 5.2223 4.7062 4.8797 5.3069 2.9529 4.1495 3.9057 4.8343 3.1413 3.0678 4.2233 1.0996 3.4877 5.6839 7.0386 5.7196 1.1869 5.6063 5.6092 6.4565 6.0980 4.4812 5.7751 4.0913 2.1565 2.4726 3.9381 3.0370 1.9351 1.5775 6.4066 3.7557 1.5041 1.2472 1.5030 1.6392 1.3352 2.6784 2.0164 1.6357 2.7529 1.7786 2.5634 1.3634 2.9801 1.1555 1.9963 3.1097 2.7928 1.5977 1.9308 1.9021 1.7216 1.6787 4.1335 1.1966 2.7126 1.3092 1.2165 1.8449 3.6034 1.1061 1.0453 1.1039 1.0511 1.1890 1.0943 2.0595 3.2632 4.4076 6.1879 4.9941 5.8748 5.7873 12.0146 7.7727 1.0376 1.0367 1.0362 1.0956 1.0855 1.0941 1.1015 1.0999 1.0996 1.0987 1.0886 1.0907 1.0910 1.0961 1.0946 1.0644 1.0764
irintensity: 5.5892 1.2968 2.3783 0.9185 0.0840 0.2344 5.1311 1.1628 1.6852 0.2147 1.9421 7.6261 0.8833 1.6219 0.1967 2.7230 5.7346 2.0969 15.2664 27.7231 2.8352 1.6208 2.6896 10.1763 0.2069 0.2303 1.5571 3.1574 1.0944 16.6388 20.5161 1.0120 132.9661 0.4515 10.7093 0.7463 9.8780 53.4449 31.4789 7.9610 8.4620 32.2034 19.3005 27.9699 19.6042 22.2966 17.9345 2.8043 54.3653 45.9121 32.0011 5.0178 9.4257 3.7824 4.4947 22.0173 12.9874 4.2245 1.4829 4.6629 14.3454 164.9316 30.9595 135.8439 25.8589 115.9553 8.8622 23.0446 69.8491 49.2268 37.8187 31.8311 41.2214 159.6658 126.4874 23.1699 21.2191 167.7065 24.5887 15.2097 35.0620 37.2446 22.2949 15.0378 27.1181 18.0226 66.6900 20.4866 166.3254 300.6951 104.1727 55.4832 95.2889 153.5568 306.4340 237.1093 274.8448 16.7417 11.1251 13.4449 14.3260 5.3379 8.7968 21.2182 11.9220 46.0695 9.7025 21.4681 10.2267 4.4652 9.7765 6.6840 122.7358 12.9718
temp: 298.150 k
press: 1.00000 atm
elementType: 8 8 8 8 8 7 6 6 6 6 6 6 6 6 6 6 6 6 6 6 6 6 6 1 1 1 1 1 1 1 1 1 1 1 1 1 1 1 1 1
symmnumber: 1
zpe: 803122.8 jmol-1
zpe.correction: 0.305893 hartree
zpe.thermalcorrener: 0.328807 hartree
zpe.thermalcorrenthalpy: 0.329751 hartree
zpe.thermalcorrgfe: 0.250386 hartree
zpe.sumelectzpe: -1087.216840 hartree
zpe.sumelectthermal: -1087.193926 hartree
zpe.sumelectthermalent: -1087.192982 hartree
zpe.sumelectthermalfe: -1087.272347 hartree
dipole: -0.4007 4.4582 2.0374
dipole: 4.9181
quadrupole: -98.6640 -144.7617 -133.3928
quadrupole: 1.9046 -21.8547 -1.3025
quadrupole: 26.9422 -19.1556 -7.7866 1.9046 -21.8547 -1.3025
hfenergy: -1087.5227331 hartree
pointgroup: C01 [X(C17H17N1O5)]
dipole: 0.6947603 -1.7843823 0.2779029 debye
polarizability: 285.0831261|-7.0116211|221.7505188|2.0113209|2.3744034|179.5739471 unknown
InChI: InChI=1S/C17H17NO5/c1-9(2)8-13(20)14-15(21)17(22)23-16(14)11-4-6-12(7-5-11)18-10(3)19/h4-8,16,18,21H,1-3H3
charge 0 multiplicity 1
40 atoms
O  -1.274555 2.106325 1.730847
O  -3.830347 0.680359 -0.397617
O  -0.881932 -2.183397 1.46566
O  -3.079859 3.226311 0.707832
O  4.623262 1.125235 -2.307696
N  4.711177 0.502038 -0.043662
C  -0.789379 0.651692 1.723553
C  -1.816617 -0.085432 0.866892
C  0.642205 0.607651 1.231381
C  -2.725628 0.829876 0.406118
C  1.683489 0.248442 2.117992
C  0.968906 0.935373 -0.106517
C  -1.739317 -1.563055 0.737834
C  -2.412308 2.192509 0.935681
C  3.339787 0.551893 0.334361
C  3.018339 0.217835 1.677741
C  2.2995 0.914919 -0.564663
C  -2.658977 -2.21818 -0.206598
C  -2.681279 -3.568401 -0.483408
C  -3.675548 -4.117257 -1.484039
C  -1.754226 -4.578814 0.158561
C  5.287633 0.778053 -1.288086
C  6.807566 0.630722 -1.330174
H  -0.842921 0.324868 2.776457
H  1.448202 -0.023246 3.153066
H  0.17464 1.213499 -0.809086
H  3.815182 -0.068682 2.376117
H  2.550592 1.170458 -1.595205
H  -3.369116 -1.56322 -0.723963
H  5.357306 0.227952 0.699724
H  -4.268498 1.574177 -0.494002
H  -3.145207 -4.607775 -2.32438
H  -4.337691 -3.337207 -1.89447
H  -4.301383 -4.901747 -1.0143
H  -1.951471 -4.655236 1.244492
H  -1.871872 -5.576445 -0.298955
H  -0.700611 -4.255503 0.08991
H  7.252957 1.601737 -1.6079
H  7.074626 -0.088405 -2.123289
H  7.255371 0.294376 -0.378808
