program: Gaussian 09
title: 000234427
version: EM64L-G09RevD.01
frameworkgroup: C1[X(C18H22O6)]
method: RPBEPBE
basis: SDD
operation: Freq
keyword: #pfreq=noraman
keyword: PBEPBE/SDD
title: #p freq=noraman PBEPBE/SDD
converged: YES YES NO NO
title: Mulliken charges:
elementType: O O O O O O C C C C C C C C C C C C C C C C C C H H H H H H H H H H H H H H H H H H H H H H
charge: -0.266672 -0.279951 -0.264541 -0.304659 -0.270984 -0.276080 0.318634 0.187112 0.023907 0.063033 -0.370571 -0.362667 0.058898 0.066187 0.237880 0.239827 -0.394419 -0.374969 -0.520958 -0.519555 -0.521301 -0.519008 -0.536005 -0.535931 0.221602 0.262857 0.237648 0.242458 0.230342 0.232669 0.238429 0.227201 0.202622 0.267650 0.228383 0.245624 0.208508 0.226913 0.255612 0.216325 0.224923 0.218125 0.242734 0.243578 0.227702 0.220892
chargesum: 0.00000
title: Mulliken charges with hydrogens summed into heavy atoms:
elementType: O O O O O O C C C C C C C C C C C C C C C C C C
charge: -0.266672 -0.279951 -0.264541 -0.304659 -0.270984 -0.276080 0.318634 0.187112 0.023907 0.063033 -0.148969 -0.099810 0.058898 0.066187 0.237880 0.239827 -0.156772 -0.132511 0.180482 0.177917 0.161213 0.179843 0.149778 0.156240
polarizability: 3.35965296e+02 -1.59623767e+01 2.10447841e+02 2.31726112e+00 4.99524375e-01 1.59898206e+02
1716.lowfreq: -10.6177 -3.7008 -0.0008 -0.0006 -0.0005 2.9973 15.5889 32.1510 42.5038
frequency: 15.1093 32.1171 42.5021 61.3192 63.6838 66.7665 70.2795 76.5198 89.0079 99.5857 103.8698 124.4292 137.4574 142.9239 151.6126 156.3813 161.5667 173.7836 195.1131 200.7380 212.2228 223.9360 240.0532 252.1688 279.2846 290.4201 294.4618 316.1164 327.2879 355.4419 373.8934 384.6440 402.4984 416.6639 462.8903 487.1851 512.9316 561.0124 569.2368 583.7102 606.0241 631.1669 646.7302 659.3763 664.4488 688.4148 772.4729 777.6634 789.7977 790.3321 804.5876 827.6206 856.2540 892.1004 919.3631 928.0882 952.9138 967.2427 969.8970 1015.7588 1057.2965 1069.4501 1105.3205 1106.0755 1107.7852 1108.0278 1111.3535 1111.6046 1117.9133 1139.2002 1146.5128 1148.9982 1152.6398 1154.2500 1157.6243 1185.4574 1190.3818 1199.2277 1212.5272 1253.0163 1254.6013 1311.7525 1348.3653 1358.2901 1382.0606 1398.2736 1420.7870 1425.8122 1434.6719 1435.3450 1436.7554 1448.7563 1453.2071 1455.0739 1455.6156 1457.4367 1461.8196 1465.3130 1466.9406 1473.8786 1474.4857 1477.5670 1478.4810 1481.6136 1484.6140 1491.5901 1556.0498 1566.8051 1597.5638 1603.5061 2959.1774 2962.7670 2966.4103 2966.7363 2974.3810 2976.0419 3047.3928 3052.0288 3066.1132 3076.5045 3077.7483 3079.8473 3096.1352 3116.9440 3120.7487 3122.0547 3124.4367 3124.6590 3141.2620 3146.6272 3168.4862 3169.6882
redmass: 4.2039 4.4562 4.5039 2.6576 2.5665 2.7353 1.9657 2.1245 2.2055 3.2015 3.3750 1.8696 2.2671 1.3619 1.7877 1.5955 1.8559 2.6994 3.2095 3.6395 3.2221 4.4428 1.2693 1.3320 4.1778 4.1255 6.3288 4.9805 4.9375 4.7216 5.1494 4.8810 4.8099 4.7391 6.2186 5.9059 6.9667 4.6545 5.7443 5.1034 5.3279 5.3757 4.5862 4.5917 4.4136 5.9674 4.9071 3.7292 1.8843 3.2348 2.3449 7.1402 6.9365 7.4408 1.3499 1.3675 9.5917 9.1400 9.2053 7.3991 6.1125 4.2340 1.2414 1.2266 1.2361 1.2377 1.2586 1.2663 2.2227 1.4364 1.4635 1.4875 1.3790 1.4037 1.4718 2.5145 1.8339 2.7341 1.7428 3.0179 2.4240 3.2743 7.6188 10.3802 2.9526 1.8615 1.2603 1.2021 1.4600 1.2439 1.1824 1.4628 1.2085 1.0966 1.0645 1.1942 1.5624 1.0508 1.0505 1.1129 1.0790 1.1374 1.0545 1.0545 1.0725 2.7749 7.1548 7.4298 7.2657 7.7151 1.0328 1.0326 1.0357 1.0326 1.0289 1.0316 1.1038 1.1039 1.1012 1.0955 1.1044 1.1016 1.1043 1.1025 1.1037 1.0995 1.0999 1.1048 1.0878 1.0877 1.0961 1.0947
irintensity: 2.0177 0.8406 1.3928 9.4539 1.6887 4.1070 0.2748 5.8410 8.7778 4.7163 1.9658 6.3950 3.3119 1.9705 1.3604 3.6040 10.6385 1.4668 4.9301 1.0999 3.2605 0.7138 0.3098 0.9440 2.4092 8.6525 1.8362 3.9679 1.7254 8.1443 1.4657 5.2596 5.3587 0.9826 0.9760 3.5701 20.1845 2.1291 6.2424 3.0478 1.3910 5.0176 8.8291 5.9921 22.0626 9.2906 8.6189 20.4004 57.8027 10.4199 4.2307 4.2365 14.0660 13.2797 0.3170 1.1330 76.1024 16.4941 25.5800 16.8314 434.9578 168.6927 6.6386 1.6598 8.4047 5.5237 0.6186 1.3880 40.3802 4.1083 2.9099 13.9884 11.2345 10.6711 18.5316 13.2214 22.0125 25.5991 75.6735 325.3400 24.2751 4.4907 49.0446 3.4912 98.1082 29.0507 63.0721 6.7476 33.4315 52.2636 3.0314 40.4954 105.5933 31.9940 16.9910 14.1191 205.8631 13.7329 13.3880 13.4526 10.0001 8.5246 10.9868 12.2561 16.5774 2.1024 0.2287 1.5646 79.6494 38.4933 80.1735 79.4365 83.0290 73.8344 39.1640 98.6055 46.1936 43.1340 40.3179 37.8867 28.2267 32.5573 33.3380 26.2822 19.8445 28.5424 27.7621 11.4072 10.0663 5.6889 10.1067 14.5006
temp: 298.150 k
press: 1.00000 atm
elementType: 8 8 8 8 8 8 6 6 6 6 6 6 6 6 6 6 6 6 6 6 6 6 6 6 1 1 1 1 1 1 1 1 1 1 1 1 1 1 1 1 1 1 1 1 1 1
symmnumber: 1
zpe: 955810.1 jmol-1
zpe.correction: 0.364049 hartree
zpe.thermalcorrener: 0.390646 hartree
zpe.thermalcorrenthalpy: 0.391590 hartree
zpe.thermalcorrgfe: 0.305823 hartree
zpe.sumelectzpe: -1148.529921 hartree
zpe.sumelectthermal: -1148.503324 hartree
zpe.sumelectthermalent: -1148.502380 hartree
zpe.sumelectthermalfe: -1148.588147 hartree
dipole: 2.1378 1.7469 0.2604
dipole: 2.7730
quadrupole: -114.2322 -132.9306 -131.7037
quadrupole: -24.8902 -1.7267 -2.4724
quadrupole: 12.0566 -6.6418 -5.4148 -24.8902 -1.7267 -2.4724
hfenergy: -1148.89397 hartree
pointgroup: C01 [X(C18H22O6)]
dipole: 0.7952807 -0.7315914 -0.1501551 debye
polarizability: 337.3824179|8.2541528|208.7618653|-4.0126908|3.072354|160.1670598 unknown
InChI: InChI=1S/C18H22O6/c1-19-13-9-7-11(15(21-3)17(13)23-5)12-8-10-14(20-2)18(24-6)16(12)22-4/h7-10H,1-6H3
charge 0 multiplicity 1
46 atoms
O  -1.180254 2.28598 -0.321275
O  0.933928 -1.720301 -0.894213
O  -3.861598 2.130725 0.028064
O  3.74036 -1.597019 -0.587728
O  -5.083387 -0.189264 0.946676
O  4.891192 0.383546 1.002693
C  -0.838339 -0.00866 0.598618
C  0.649754 0.122702 0.654815
C  -1.676944 1.076538 0.198446
C  1.51908 -0.785889 -0.019215
C  -1.463162 -1.189644 1.062931
C  1.234548 1.154471 1.427166
C  -3.092606 0.995912 0.331137
C  2.932586 -0.661373 0.090814
C  -3.681019 -0.201075 0.835155
C  3.487506 0.363099 0.913446
C  -2.862289 -1.301914 1.179379
C  2.631645 1.280753 1.566585
C  -0.18923 2.201525 -1.414061
C  1.251564 -3.147846 -0.679376
C  -4.805871 1.990603 -1.09798
C  4.669443 -1.03925 -1.59488
C  -5.719489 -1.374472 1.524594
C  5.491254 1.385654 1.887779
H  -0.831744 -2.028749 1.372876
H  0.574105 1.863257 1.936425
H  -3.298246 -2.228967 1.561557
H  3.039072 2.079637 2.192307
H  -0.423251 3.043593 -2.086433
H  -0.274656 1.243136 -1.95842
H  0.836524 2.307412 -1.01996
H  0.689347 -3.683794 -1.459459
H  0.903167 -3.471787 0.321339
H  2.334321 -3.327183 -0.778784
H  -5.287555 2.976039 -1.191764
H  -5.56154 1.213903 -0.885895
H  -4.26064 1.749818 -2.03158
H  5.159831 -1.914056 -2.049025
H  5.416454 -0.387021 -1.112207
H  4.108008 -0.478501 -2.366345
H  -5.355765 -1.562192 2.553325
H  -5.547422 -2.273483 0.900698
H  -6.794023 -1.139836 1.548125
H  6.574211 1.199567 1.837612
H  5.137894 1.260558 2.92918
H  5.272034 2.414551 1.542055
