program: Gaussian 09
title: 000234390
version: EM64L-G09RevD.01
frameworkgroup: C1[X(C14H20O3)]
method: RPBEPBE
basis: SDD
operation: Freq
keyword: #pfreq=noraman
keyword: PBEPBE/SDD
title: #p freq=noraman PBEPBE/SDD
converged: YES YES NO NO
title: Mulliken charges:
elementType: O O O C C C C C C C C C C C C C C H H H H H H H H H H H H H H H H H H H H
charge: -0.310049 -0.274956 -0.269423 0.369049 -0.424015 -0.005538 -0.343366 -0.586065 -0.735935 -0.701049 0.511704 -0.391341 -0.415293 -0.355621 -0.357053 0.314427 -0.538342 0.224193 0.226039 0.211828 0.195347 0.227459 0.238642 0.207834 0.232769 0.229845 0.221631 0.238633 0.208469 0.221591 0.236830 0.228511 0.245656 0.236064 0.219099 0.243329 0.219097
chargesum: 0.00000
title: Mulliken charges with hydrogens summed into heavy atoms:
elementType: O O O C C C C C C C C C C C C C C
charge: -0.310049 -0.274956 -0.269423 0.369049 0.026217 0.206290 0.079441 -0.139589 -0.051691 -0.032355 0.511704 -0.154511 -0.186782 -0.109965 -0.120989 0.314427 0.143183
polarizability: 2.17898939e+02 -3.59339122e+00 1.56480407e+02 1.15917914e+01 3.20573456e-02 1.10134968e+02
1716.lowfreq: -16.2857 -7.0164 -4.2246 -0.0003 0.0004 0.0006 10.7319 17.6084 42.0919
frequency: 7.6781 16.7275 42.0442 46.6763 90.1579 93.4844 128.1283 165.1985 179.9830 198.7920 211.6193 220.0704 236.5791 262.2313 310.8234 316.6593 342.9502 365.0176 412.8165 424.1045 437.8476 448.1665 479.7201 515.7465 542.2065 568.4849 630.4958 634.2259 710.0340 723.1204 745.4932 773.4979 793.0065 810.7525 823.4892 834.7970 844.1242 889.2756 920.7915 935.8982 947.3127 962.0964 965.7010 989.3678 992.6156 1003.1739 1028.7910 1064.6873 1075.5973 1097.6903 1111.9806 1120.9913 1127.6635 1146.9671 1155.3394 1177.7586 1187.3244 1209.1515 1216.6646 1228.5033 1235.5436 1269.5281 1292.9093 1298.7774 1305.8310 1311.7283 1339.8688 1360.2569 1380.4949 1383.1143 1391.1167 1416.0464 1435.8451 1447.8219 1459.5051 1461.7875 1465.4519 1465.5485 1468.6026 1472.5684 1478.5990 1486.0891 1501.7243 1585.0485 1624.0548 2955.1811 2962.0286 2975.5143 2988.7552 2990.4178 2997.2968 3000.2166 3041.0259 3041.9013 3067.4527 3086.2041 3092.1583 3100.1058 3100.5362 3109.0379 3116.2117 3121.6261 3122.2895 3157.5304 3163.8835
redmass: 3.5457 3.6095 4.1273 4.3398 2.5989 3.3468 3.0856 2.8908 2.6884 1.2271 1.0903 2.6365 1.3064 2.2662 3.2603 2.8524 2.8731 3.4994 2.9460 4.0646 3.3183 2.6688 3.4692 3.6362 2.8602 3.2987 4.7865 6.2715 4.1342 5.2792 3.6351 1.6674 2.1710 1.5220 2.0080 3.0874 2.2277 2.0392 1.9512 1.4408 1.4935 1.5134 1.6495 6.6340 4.0464 2.6962 3.4668 2.1699 1.5475 2.0469 1.2608 1.5599 1.5040 1.8834 1.3375 1.2237 1.4102 1.7954 2.0473 4.3299 2.3012 1.4074 1.3333 1.3069 1.2597 1.2774 1.4638 1.5492 1.4903 3.1919 1.2602 3.2477 1.1707 1.0752 1.0561 1.0579 1.0507 1.0654 1.0805 1.0723 1.0505 1.1057 2.4813 7.0112 6.5003 1.0332 1.0784 1.0733 1.0595 1.0362 1.0581 1.0375 1.1038 1.0993 1.1039 1.0991 1.0987 1.1002 1.0995 1.1002 1.0893 1.0963 1.0918 1.0936 1.0952
irintensity: 1.9091 1.1215 0.6821 1.0123 3.6234 3.7868 3.5984 0.3591 2.3399 1.2760 0.6294 3.1868 0.2739 1.0941 0.9334 1.2806 0.3634 1.6686 0.0428 2.8779 9.3531 4.5980 21.5824 22.6855 10.9927 5.8271 2.7815 0.8332 5.2893 5.0121 7.8276 11.4686 19.5894 38.1538 13.9456 35.4757 17.7892 14.7289 3.4443 0.5399 1.5775 0.5603 4.2131 97.5842 41.2672 8.0954 11.4206 61.1326 16.0938 42.1969 0.1984 8.0339 3.3527 13.2688 0.7221 51.5230 39.9306 79.5451 37.9213 158.8199 24.3305 19.3442 29.6896 1.0122 0.7952 2.8968 8.6688 3.2232 42.8048 13.8812 19.5534 1.3848 9.5414 3.1296 8.3532 2.0012 14.7894 5.1024 13.8392 56.2372 9.0605 12.1587 128.6210 6.6694 32.5674 73.0842 31.5606 73.9060 7.4187 24.3144 42.1223 8.5222 52.3485 1.3714 32.4403 7.8765 49.7474 27.5333 28.8838 32.8761 22.1944 33.8986 6.5076 17.9152 5.3698
temp: 298.150 k
press: 1.00000 atm
elementType: 8 8 8 6 6 6 6 6 6 6 6 6 6 6 6 6 6 1 1 1 1 1 1 1 1 1 1 1 1 1 1 1 1 1 1 1 1
symmnumber: 1
zpe: 816269.1 jmol-1
zpe.correction: 0.310900 hartree
zpe.thermalcorrener: 0.328668 hartree
zpe.thermalcorrenthalpy: 0.329612 hartree
zpe.thermalcorrgfe: 0.262109 hartree
zpe.sumelectzpe: -769.824820 hartree
zpe.sumelectthermal: -769.807052 hartree
zpe.sumelectthermalent: -769.806108 hartree
zpe.sumelectthermalfe: -769.873612 hartree
dipole: -0.2587 -0.3364 0.4991
dipole: 0.6551
quadrupole: -82.3202 -96.7178 -107.9505
quadrupole: -14.9409 3.4111 2.5177
quadrupole: 13.3426 -1.0549 -12.2877 -14.9409 3.4111 2.5177
hfenergy: -770.1357203 hartree
pointgroup: C01 [X(C14H20O3)]
dipole: -0.1034086 -0.1505971 0.1817949 debye
polarizability: 217.6188528|-4.3330974|156.0207481|12.6849792|4.3204743|110.8747135 unknown
InChI: InChI=1S/C14H20O3/c1-11-10-16-14(2,17-11)9-8-12-4-6-13(15-3)7-5-12/h4-7,11H,8-10H2,1-3H3
charge 0 multiplicity 1
37 atoms
O  -3.160174 0.245007 -0.782497
O  -3.450973 -0.989293 1.230755
O  5.086216 0.887209 0.491668
C  -2.679994 -0.962109 -0.046535
C  -1.183227 -0.766666 0.260847
C  -4.306354 0.823037 -0.026206
C  -4.005894 0.364852 1.414773
C  -0.296261 -0.589728 -1.002293
C  -3.032155 -2.236649 -0.814696
C  -4.330354 2.331858 -0.258424
C  1.138657 -0.234028 -0.642152
C  1.53691 1.121741 -0.484418
C  2.110294 -1.236462 -0.410822
C  2.849033 1.462902 -0.108227
C  3.435412 -0.917561 -0.031627
C  3.804128 0.441276 0.121793
C  6.107189 -0.131626 0.737569
H  -0.830864 -1.632664 0.853045
H  -1.081624 0.128653 0.902645
H  -5.245156 0.350701 -0.384108
H  -3.267745 1.039118 1.896606
H  -4.899256 0.263448 2.051166
H  -0.74647 0.20338 -1.627507
H  -0.311768 -1.524117 -1.59551
H  -4.122555 -2.289719 -0.96795
H  -2.536525 -2.245292 -1.799749
H  -2.712876 -3.12626 -0.243849
H  -4.447427 2.553925 -1.332806
H  -5.17518 2.795313 0.283809
H  -3.38827 2.791272 0.08893
H  0.807281 1.920471 -0.666694
H  1.832671 -2.291343 -0.53216
H  3.159327 2.506027 0.008093
H  4.157685 -1.722845 0.133927
H  5.818537 -0.800863 1.572035
H  7.013785 0.428874 1.009766
H  6.302074 -0.736642 -0.169899
