program: Gaussian 09
title: 000234389
version: EM64L-G09RevD.01
frameworkgroup: C1[X(C10H9BrO3S)]
method: RPBEPBE
basis: SDD
operation: Freq
keyword: #p
keyword: freq=noraman
keyword: PBEPBE/SDD
title: #p freq=noraman PBEPBE/SDD
converged: YES YES NO NO
title: Mulliken charges:
elementType: Br S O O O C C C C C C C C C C H H H H H H H H H
charge: 0.019707 0.150091 -0.262236 -0.257464 -0.178782 0.712651 0.198137 0.186513 -0.493632 -0.413013 -0.878312 -0.283325 -0.202021 0.011105 -0.705427 0.266205 0.283224 0.331857 0.275029 0.245525 0.238336 0.242566 0.259499 0.253766
chargesum: 0.00000
title: Mulliken charges with hydrogens summed into heavy atoms:
elementType: Br S O O O C C C C C C C C C C
charge: 0.019707 0.150091 -0.262236 -0.257464 -0.178782 0.712651 0.198137 0.186513 -0.227426 -0.413013 -0.263231 -0.008297 0.281840 0.011105 0.050404
polarizability: 2.40581671e+02 1.80827721e+01 1.35417645e+02 -3.81720818e+00 3.76708247e+00 9.14131919e+01
1716.lowfreq: -6.6609 -4.6136 -3.1185 -0.0019 -0.0012 -0.0011 29.5563 35.1632 61.4050
frequency: 29.5451 35.1548 61.3986 72.2351 78.2303 95.9077 112.5609 136.6114 172.3550 205.0887 254.6125 263.3530 308.5698 330.2841 369.5276 425.5655 444.5610 458.9171 504.4800 527.4792 577.6462 595.6185 647.4375 678.8454 679.4107 723.5212 743.6627 791.9639 835.9379 859.0288 877.5313 900.1970 940.3972 963.9041 975.4502 1011.2713 1068.0193 1070.3731 1110.2732 1125.8708 1140.8369 1172.8235 1235.1195 1253.9583 1256.4488 1358.8258 1376.7831 1377.9121 1410.7796 1445.5487 1455.9051 1460.6453 1463.9299 1484.2122 1603.3121 1620.9874 1638.6005 2994.4398 3008.2129 3016.5464 3088.5970 3104.3008 3112.8706 3119.8182 3169.6012 3192.7706
redmass: 6.4981 5.9264 4.9644 2.8185 1.2477 3.7193 7.0189 10.4171 8.9180 7.8813 5.7237 7.1758 3.9238 4.4580 4.9153 4.2191 4.6804 5.7726 3.5634 5.5632 4.1195 10.2593 7.5805 9.2942 7.7787 4.3608 5.6656 5.7012 8.6844 1.4359 1.4515 1.6828 4.7619 2.5658 4.7969 1.5421 1.6700 3.0490 2.3286 1.0579 1.2939 1.6033 1.2993 1.2118 6.0295 1.4554 1.3117 2.4842 6.6612 1.0550 1.0659 1.2917 2.0051 1.2753 8.6438 9.1400 9.9834 1.0364 1.0595 1.0615 1.0958 1.1038 1.1122 1.1021 1.0930 1.0937
irintensity: 0.4428 0.1384 4.1839 11.4577 1.7112 3.1750 2.3989 2.9054 0.7783 0.6362 4.0152 0.2979 2.5817 1.5087 0.5611 10.1272 7.7449 5.7689 1.2504 20.2742 74.7751 40.8668 10.5936 2.4054 4.4597 2.9733 1.0541 14.0075 33.9356 9.3158 34.2489 7.9150 66.3244 25.9160 152.6585 4.5779 10.7726 38.6651 196.7730 1.6894 24.2572 15.0997 13.9999 0.7215 192.4033 3.9488 57.9436 20.7640 6.1538 21.7801 28.1086 67.0220 181.8340 33.2325 0.9063 6.9249 197.4489 2.0693 123.8383 15.9674 7.8481 8.4531 27.9447 8.9100 1.5313 0.9330
temp: 298.150 k
press: 1.00000 atm
elementType: 35 16 8 8 8 6 6 6 6 6 6 6 6 6 6 1 1 1 1 1 1 1 1 1
symmnumber: 1
zpe: 440384.8 jmol-1
zpe.correction: 0.167734 hartree
zpe.thermalcorrener: 0.182941 hartree
zpe.thermalcorrenthalpy: 0.183885 hartree
zpe.thermalcorrgfe: 0.122348 hartree
zpe.sumelectzpe: -1022.534814 hartree
zpe.sumelectthermal: -1022.519607 hartree
zpe.sumelectthermalent: -1022.518663 hartree
zpe.sumelectthermalfe: -1022.580200 hartree
dipole: -1.7652 -1.6109 1.5500
dipole: 2.8484
quadrupole: -85.7836 -104.4720 -104.1918
quadrupole: -1.1492 5.3969 1.6166
quadrupole: 12.3656 -6.3229 -6.0427 -1.1492 5.3969 1.6166
hfenergy: -1022.7025476 hartree
pointgroup: C01 [X(C10H9Br1O3S1)]
dipole: -0.6286458 -0.7995439 0.4705311 debye
dipolederiv: -0.2792683 -0.2834538 -0.0529563 -0.2576147 -0.3274764 -0.0753558 -0.0727392 -0.0887595 -0.0437128 -1.0546654 -0.171536 -0.0020647 -0.3090991 -0.2581322 -0.0027376 -0.0724089 0.0118152 -0.1100382 -1.3751829 -0.383427 0.0884088 -0.4513525 -0.5336516 -0.0471581 0.0292665 -0.0649392 -0.3102075 -1.5610406 -0.2568711 0.1403504 -0.1887788 -0.4531032 -0.0321116 0.1893432 -0.0233556 -0.2971414 -0.7186349 -0.1284158 -0.0168884 -0.5155683 -0.6268017 0.29762 0.3471182 0.39469 -0.622922 -0.0767667 -0.1210736 -0.0030673 -0.1622192 -0.1687328 -0.0204446 -0.0338809 -0.0828707 -0.0887004 0.7580132 0.4016954 0.0559631 0.9379299 0.3476142 -0.0410533 0.34574 0.0640104 0.0187366 1.2329438 0.1463177 -0.1483785 -0.3238281 -0.0492138 0.0368584 -0.3869672 -0.0618975 0.0912415 -0.0608188 -0.033896 -0.0659788 0.043577 -0.009628 0.07248 -0.0353322 0.0728391 -0.10493 0.4055612 0.4745477 0.0646583 0.4660954 0.5446009 0.1723602 0.1140681 0.2275215 -0.0788129 0.4894489 -0.1879635 0.0655221 -0.3314408 0.0914275 0.0289623 0.2334393 0.0311329 0.1850243 -0.3031363 -0.0624741 -0.0069459 -0.2238895 -0.0991104 0.0370687 -0.0569226 0.0062117 -0.0720989 1.1738765 0.2188753 -0.107862 0.2805715 0.6217016 -0.0565813 -0.1552147 -0.0798256 0.5946878 1.5165838 0.4378331 0.1852926 1.1504528 0.6318564 -0.3040654 -0.1969265 -0.3841146 0.6116143 -0.3349791 0.026658 -0.2382675 -0.173502 0.0395876 -0.0405941 -0.2740157 0.0294955 -0.2020138 0.1001883 0.0152025 0.0363683 0.0142871 0.0079606 -0.0748055 0.0260304 -0.0741114 0.1206803 -0.0033559 -0.0103931 -0.0729588 0.0702171 0.0043903 -0.092661 -0.0653371 -0.0540783 -0.0319908 0.0660242 -0.0073082 0.0257246 0.0621858 0.0374743 0.0609846 -0.0797175 0.024938 0.076716 0.0958685 0.0138744 0.0233049 0.0209364 0.0456558 -0.0639768 0.0329712 -0.0647353 0.1391594 -0.1430593 -0.0289542 -0.0487572 -0.0036201 0.0681882 0.0190946 -0.1048582 0.0059641 0.0212732 -0.0184895 -0.0262519 0.0154918 -0.1075752 -0.0176906 0.0862932 0.1514998 0.1206047 -0.0995929 0.1073962 -0.0766907 0.020137 -0.0125602 -0.0430489 0.0884388 0.0188314 0.0433224 0.1010751 0.0780412 0.0411898 0.0114011 0.0207499 0.018809 -0.0863646 -0.0225613 -0.0699788 0.0377032 -0.0945482 0.0025151 0.0315023 -0.0059542 0.1273231 0.0377488 0.0685738 0.0161209 0.0642499 unknown
polarizability: 235.5925628|28.8706545|137.7088464|2.3419982|11.8925963|94.111099 unknown
InChI: InChI=1S/C10H9BrO3S/c1-6(12)15-4-7-2-9-10(3-8(7)11)14-5-13-9/h2-3H,4-5H2,1H3
charge 0 multiplicity 1
24 atoms
Br 1.180359 2.409963 0.43213
S  2.641403 -1.201566 0.339706
O  -3.33132 -1.636686 -0.483683
O  -3.847603 0.423356 0.637407
O  4.262625 0.723737 -0.776062
C  0.154024 -0.163018 -0.568004
C  -2.165164 -0.845528 -0.339023
C  -2.471115 0.364222 0.319091
C  -0.879023 -1.12887 -0.790641
C  -0.187962 1.044933 0.097349
C  1.544516 -0.477281 -1.054949
C  -1.500578 1.339007 0.552159
C  -4.381429 -0.925029 0.293781
C  4.151833 -0.126297 0.132603
C  5.192747 -0.386013 1.204479
H  -0.653118 -2.067632 -1.30372
H  1.525889 -1.237361 -1.850206
H  2.106825 0.407141 -1.404749
H  -1.738772 2.278796 1.05345
H  -5.275474 -0.804683 -0.336665
H  -4.5779 -1.481248 1.228932
H  5.063688 -1.370895 1.681306
H  5.099926 0.393225 1.984388
H  6.201824 -0.306774 0.766318
