program: Gaussian 09
title: 000234374
version: EM64L-G09RevD.01
frameworkgroup: C1[X(C12H8ClNO3)]
method: RPBEPBE
basis: SDD
operation: Freq
keyword: #p
keyword: freq=noraman
keyword: PBEPBE/SDD
title: #p freq=noraman PBEPBE/SDD
converged: YES YES NO NO
title: Mulliken charges:
elementType: Cl O O O N C C C C C C C C C C C C H H H H H H H H
charge: -0.040823 -0.246715 -0.239702 -0.203042 0.021823 0.424237 0.203428 -0.286113 0.353265 -0.320496 -0.322060 -0.225403 -0.239352 -0.348746 -0.220574 -0.271828 -0.146117 0.260672 0.254260 0.259345 0.238045 0.324023 0.239177 0.263276 0.269421
chargesum: 0.00000
title: Mulliken charges with hydrogens summed into heavy atoms:
elementType: Cl O O O N C C C C C C C C C C C C
charge: -0.040823 -0.246715 -0.239702 -0.203042 0.021823 0.424237 0.203428 -0.025441 0.353265 -0.320496 -0.067800 0.033941 -0.001307 -0.024722 0.018603 -0.008552 0.123304
polarizability: 2.88184736e+02 -2.72580779e+01 1.54030611e+02 4.97578411e+00 7.96996136e-01 9.39142194e+01
1716.lowfreq: -7.4802 -0.0014 -0.0010 0.0005 2.2620 5.7645 28.8840 42.6536 59.6793
frequency: 28.8748 42.6399 59.6714 69.0226 87.4927 144.9111 165.2907 182.3476 216.0643 262.3903 273.9616 321.6346 365.1852 400.2820 411.7172 449.3270 481.0360 528.2627 583.8809 603.1252 637.1363 640.8695 679.7381 712.3426 725.9574 745.1454 763.5318 766.8568 799.9360 849.3432 863.6037 866.1649 877.3283 916.3622 921.0838 951.0666 968.5206 987.7130 1022.0082 1024.4475 1049.9788 1072.5313 1115.0585 1128.1266 1138.6185 1175.9219 1188.8845 1227.8139 1250.0609 1276.4697 1337.7836 1345.8102 1363.2634 1382.9448 1420.1855 1454.6225 1465.9530 1535.9931 1568.7939 1603.7991 1643.9961 3122.9486 3141.6258 3154.2124 3168.1256 3178.9096 3229.4709 3261.1616 3286.2497
redmass: 8.8510 7.8411 6.8819 6.1087 7.1259 5.7851 6.6917 9.2144 5.4788 7.2087 6.9496 6.1355 8.4240 5.3230 8.7537 3.4627 5.7134 4.5443 3.0595 7.4441 4.5347 6.6439 6.4152 5.5225 8.2182 2.5727 1.2655 1.7702 7.0499 1.3142 2.5274 1.9042 5.8018 1.3596 1.3834 1.4500 4.8914 1.3399 1.7598 4.7282 1.9834 3.5940 2.2266 1.6475 1.7764 1.0618 9.8519 1.8540 1.8517 2.1454 1.6401 8.0521 8.2996 2.4111 2.2249 4.0639 2.8193 5.2900 6.1706 6.9772 8.3333 1.0862 1.0859 1.0907 1.0955 1.1006 1.0918 1.1057 1.1010
irintensity: 1.4021 1.5701 0.5304 1.8646 1.5363 0.5375 0.3668 3.3994 0.0454 0.5682 1.3176 3.6278 5.2545 1.6485 3.6561 7.9047 1.1572 0.6903 10.1813 19.7944 2.6468 11.0962 14.6660 10.2800 4.0906 41.8692 77.7362 39.8553 9.7469 16.0485 0.5231 4.2492 17.2989 0.2348 8.3096 3.3012 31.3466 0.7378 36.8331 37.9399 9.6736 29.4055 13.9056 1.6743 50.3476 0.3605 300.2543 3.0867 5.1372 74.1972 44.7768 119.4323 17.5195 3.2884 20.5800 124.2042 16.1447 2.9918 7.8240 8.0796 155.6218 3.5656 0.9951 11.1510 8.5767 14.2199 2.7394 0.2999 5.4404
temp: 298.150 k
press: 1.00000 atm
elementType: 17 8 8 8 7 6 6 6 6 6 6 6 6 6 6 6 6 1 1 1 1 1 1 1 1
symmnumber: 1
zpe: 452700.3 jmol-1
zpe.correction: 0.172424 hartree
zpe.thermalcorrener: 0.186827 hartree
zpe.thermalcorrenthalpy: 0.187771 hartree
zpe.thermalcorrgfe: 0.128932 hartree
zpe.sumelectzpe: -1201.245416 hartree
zpe.sumelectthermal: -1201.231013 hartree
zpe.sumelectthermalent: -1201.230069 hartree
zpe.sumelectthermalfe: -1201.288909 hartree
dipole: 1.1342 -2.8902 -3.0291
dipole: 4.3376
quadrupole: -71.7433 -111.5078 -106.6987
quadrupole: -1.8416 3.7780 -5.0443
quadrupole: 24.9066 -14.8579 -10.0488 -1.8416 3.7780 -5.0443
hfenergy: -1201.4178402 hartree
pointgroup: C01 [X(C12H8Cl1N1O3)]
dipole: -0.3883597 -0.439985 1.6024738 debye
dipolederiv: -0.2323738 -0.2338259 -0.1094822 -0.1816256 -0.5598575 -0.1223721 -0.0561932 -0.1111847 -0.0875047 -0.1242987 0.2157913 -0.323424 0.169926 -0.19249 0.0990331 -0.2632857 0.1055616 -0.3025618 -0.5813838 0.281909 -0.2768483 0.1068473 -0.3773808 0.1679278 -0.048829 0.1616784 -0.4591905 -0.848813 -0.0914859 0.2088532 -0.2686933 -0.3929445 0.2639898 0.3927097 0.2665831 -0.5975504 0.862638 -0.2103904 0.0970004 0.4560792 0.7042639 -0.7197505 -0.8124983 -0.6816624 1.1555277 0.1127916 -0.1308817 -0.0047107 -0.0701354 -0.1782472 0.0075261 -0.0196807 -0.0214759 -0.0392091 0.1769851 -0.1886969 0.2113591 -0.5580836 -0.3176881 0.3433136 0.8626561 0.3526873 -0.4736282 1.0041878 0.3786197 -0.4890839 0.2490041 0.1262668 -0.1262797 -0.2278393 -0.0948512 0.1625305 -0.8943453 -0.3023109 0.4015166 0.0805744 0.1176324 -0.1558161 -0.2834525 -0.1675755 0.253255 0.2572889 0.434452 0.1874286 0.1201145 0.7506249 0.2145491 0.147064 0.1862186 -0.0006764 -0.078607 -0.0102685 0.0338507 0.035789 0.0863762 -0.0114677 0.0132319 -0.0537296 -0.0405738 -0.249786 -0.1722516 -0.0380949 -0.1316628 -0.1284381 -0.0591308 -0.0751892 -0.0484634 -0.1144619 -0.0366754 0.1368887 0.0272814 0.0884185 0.0213216 0.0244018 0.0482198 0.0340091 -0.1428519 0.6020246 0.2515276 -0.3220746 0.0165248 -0.0745875 -0.0282411 0.0389635 -0.0138449 -0.0820752 0.0705363 -0.0369982 0.0629721 0.0666478 0.0718005 0.0169831 0.0626242 0.0014245 -0.1237222 -0.1154506 -0.0778884 0.1225704 -0.3487118 -0.2870624 0.1125815 0.4887166 0.1157557 -0.3570862 -0.3386731 -0.2401571 0.3643617 0.0313968 0.0844453 -0.2139828 -0.0602274 -0.2294155 0.2501918 0.1040894 0.0074499 -0.0242927 0.0766676 0.0830873 0.0484022 -0.067431 0.0304417 0.0646161 0.0862036 0.0608123 -0.0204268 0.0839602 -0.0226251 -0.0081373 0.0024301 0.028236 0.1166324 0.0662838 0.0353678 -0.0189474 0.0659725 -0.0205538 0.0060805 -0.0284655 0.0011354 0.1580553 0.0068494 -0.0815459 -0.0392128 -0.1003401 -0.0354684 -0.0327572 -0.0445703 -0.0271035 0.1498354 0.1884587 -0.0274749 0.0250186 -0.0042473 0.1436922 0.0588456 0.0081095 0.0531031 0.1189887 -0.0991621 0.011516 -0.0648255 0.0221341 0.0795826 -0.001068 -0.0685714 0.0018321 0.141729 -0.0297318 0.0051505 -0.0238587 0.0108807 0.1682704 0.0370662 -0.0329654 0.0343908 0.1442773 0.0909635 -0.0153086 0.0130698 -0.0174375 0.1499792 0.0783029 0.0244735 0.0762493 0.1054528 unknown
polarizability: 286.2046657|29.0643716|140.9805707|-13.327728|-26.7424149|108.9443295 unknown
InChI: InChI=1S/C12H8ClNO3/c13-11-6-2-1-5-10(11)12(14(15)16)8-9-4-3-7-17-9/h1-8H
charge 0 multiplicity 1
25 atoms
Cl 1.24629 -2.393427 -0.255898
O  -2.794253 -0.855395 1.482133
O  -1.385034 1.70294 -1.778984
O  0.848632 1.8683 -2.205664
N  -0.146315 1.432605 -1.498096
C  1.577141 0.408094 0.003018
C  0.135981 0.596342 -0.331325
C  -0.857932 0.01173 0.432197
C  -2.289844 -0.042497 0.402269
C  2.188058 -0.867476 0.111709
C  2.398515 1.540594 0.265789
C  3.541019 -1.029086 0.471289
C  3.751363 1.401836 0.628901
C  -3.397738 0.425895 -0.327911
C  4.326043 0.113761 0.734071
C  -4.583388 -0.09512 0.285855
C  -4.177895 -0.861206 1.374787
H  -0.460702 -0.573799 1.272307
H  1.957334 2.538069 0.177158
H  3.970408 -2.03277 0.535118
H  4.355738 2.292956 0.825378
H  -3.33563 1.06914 -1.197603
H  5.378332 -0.005806 1.012096
H  -5.609009 0.07577 -0.034045
H  -4.71041 -1.438451 2.126553
