program: Gaussian 09
title: 000234372
version: EM64L-G09RevD.01
frameworkgroup: C1[X(C10H15N)]
method: RPBEPBE
basis: SDD
operation: Freq
keyword: #pfreq=noraman
keyword: PBEPBE/SDD
title: #p freq=noraman PBEPBE/SDD
converged: YES YES NO NO
title: Mulliken charges:
elementType: N C C C C C C C C C C H H H H H H H H H H H H H H H
charge: -0.103981 -0.344203 -0.369902 -0.343796 -0.432592 -0.426369 -0.693118 0.215730 0.195892 -0.505173 -0.495004 0.170411 0.232172 0.218534 0.184766 0.191104 0.198450 0.260240 0.205495 0.244365 0.204705 0.216713 0.208280 0.214079 0.275578 0.277625
chargesum: 0.00000
title: Mulliken charges with hydrogens summed into heavy atoms:
elementType: N C C C C C C C C C C
charge: -0.103981 0.058380 0.033398 0.045757 0.033144 0.022700 -0.054047 0.215730 0.195892 -0.229595 -0.217378
polarizability: 1.27826720e+02 1.10815477e+01 1.22626784e+02 6.66194208e+00 -3.92213819e+00 8.13843662e+01
1716.lowfreq: 0.0003 0.0004 0.0006 5.7426 8.5540 10.1857 43.8156 58.0621 64.5087
frequency: 43.4101 57.9619 64.4153 68.8890 111.9261 139.1376 144.1425 167.9024 238.6664 265.1386 282.1421 314.6343 319.7851 327.4905 359.7515 435.6457 520.7459 575.5307 625.1213 628.1667 659.7967 662.2022 739.2351 793.8535 807.3361 899.1358 921.7107 936.6273 955.3480 971.4610 992.6329 1030.3722 1074.4859 1082.1377 1120.4495 1125.4211 1170.0005 1229.3169 1234.5883 1241.4770 1277.1699 1290.8894 1296.6916 1346.7693 1353.4086 1360.4197 1379.6590 1391.6684 1457.7944 1461.4880 1465.8402 1470.1038 1478.5393 1479.4140 1489.2536 2143.9199 2145.7209 2817.2348 2827.0816 2839.2721 2965.3993 2974.6679 2976.5972 3009.7630 3017.2613 3029.7732 3033.2936 3051.5951 3072.1177 3074.4405 3427.1585 3428.0839
redmass: 2.5194 2.5439 2.5257 3.4901 2.5893 2.9078 2.9684 2.7268 1.1212 3.5723 3.0781 3.0626 3.1075 2.7085 5.2483 3.0180 4.9604 5.6199 1.2300 1.2307 1.2536 1.2399 1.0780 1.6605 2.2698 1.7684 2.0175 1.7798 1.9619 2.3875 2.2242 3.3358 2.6655 2.3160 2.4718 2.5480 2.0157 1.3499 1.1655 1.2137 1.2848 1.1199 1.1663 1.4909 1.3518 1.3747 1.4025 1.2296 1.0799 1.0808 1.0743 1.0691 1.0444 1.0640 1.0867 6.0263 6.0292 1.0713 1.0712 1.0694 1.0586 1.0393 1.0591 1.0977 1.0845 1.0886 1.0841 1.1003 1.1005 1.0997 1.1595 1.1592
irintensity: 0.2737 0.0926 0.1294 0.5855 0.0972 1.2426 2.0009 1.5484 0.0673 0.8802 1.9031 0.0272 4.0019 11.8335 2.7057 3.9694 1.1341 0.9986 69.3890 79.7504 55.7866 75.8743 10.3830 8.7955 18.3507 9.0871 2.6133 3.9151 1.6655 8.4347 4.3799 1.9980 18.5448 24.3758 11.0173 48.0419 11.0155 3.9669 10.2906 14.5111 3.6793 12.1921 5.1988 3.1638 4.5046 10.8267 11.7613 8.5051 4.7566 7.8130 0.2394 0.9227 10.8760 5.0061 16.2232 1.0842 2.0445 51.4372 40.5115 191.6197 19.8787 26.8713 63.6024 6.8848 6.5101 6.8588 11.5726 31.3767 86.9519 56.6339 70.4311 56.2780
temp: 298.150 k
press: 1.00000 atm
elementType: 7 6 6 6 6 6 6 6 6 6 6 1 1 1 1 1 1 1 1 1 1 1 1 1 1 1
symmnumber: 1
zpe: 575228.4 jmol-1
zpe.correction: 0.219093 hartree
zpe.thermalcorrener: 0.232832 hartree
zpe.thermalcorrenthalpy: 0.233776 hartree
zpe.thermalcorrgfe: 0.178025 hartree
zpe.sumelectzpe: -443.796888 hartree
zpe.sumelectthermal: -443.783150 hartree
zpe.sumelectthermalent: -443.782205 hartree
zpe.sumelectthermalfe: -443.837956 hartree
dipole: 0.6512 -0.3274 1.2662
dipole: 1.4610
quadrupole: -64.2894 -64.6545 -68.7946
quadrupole: 2.1511 0.3386 -1.4154
quadrupole: 1.6234 1.2584 -2.8818 2.1511 0.3386 -1.4154
hfenergy: -444.0159812 hartree
pointgroup: C01 [X(C10H15N1)]
dipole: 0.2618227 0.1026529 -0.5012984 debye
dipolederiv: -0.6513239 -0.044811 -0.0031871 0.0640805 -0.5010887 0.0130639 0.0316001 0.0146756 -0.5232187 0.5367844 -0.0772749 -0.1193861 -0.0466799 0.0056045 -0.0120408 -0.0794752 -0.0386523 0.4296581 -0.1294624 -0.0101463 -0.0061197 -0.0417007 0.1383617 -0.0396953 0.0316966 -0.0576774 0.072253 0.0732951 -0.0154829 -0.0200652 -0.0454169 0.1068452 -0.0383466 -0.0702766 -0.0431397 0.1486251 0.2312096 0.3380512 0.0488277 0.2516119 0.4600361 0.0396662 0.047195 0.0326914 0.4522825 0.2016785 -0.2283235 0.0405462 -0.2750336 0.5535201 -0.0693517 0.0359422 -0.0689201 0.4740312 -0.0548244 -0.0444643 -0.0390136 -0.0092053 0.0706746 -0.0277303 -0.0123927 -0.0235343 0.0685837 -0.0714388 -0.0705791 0.0052695 -0.044857 0.1084945 -0.0882601 -0.0192586 -0.0812724 -0.0545823 0.1055208 -0.0535372 -0.0770414 -0.0303602 -0.0913041 0.03195 -0.0606179 0.0538913 -0.0704898 -0.3340654 0.0055402 0.0093692 -0.030703 -0.5226191 0.0452148 0.0293802 0.0679989 -0.3381128 -0.4707832 0.119196 0.0291085 0.0727616 -0.3959151 -0.0241884 0.0390015 -0.059565 -0.3230263 -0.0828533 0.0084989 -0.0066556 -0.0240316 0.0482601 0.0484102 0.1162069 -0.0137998 -0.2809614 0.0497475 0.0785716 -0.0072895 0.0649921 -0.09742 0.0061203 -0.0030778 0.0278428 0.0577144 0.0590085 0.0033266 0.0263778 0.0025301 0.0660728 0.0117265 0.0084287 -0.0039125 -0.1483743 0.0595119 0.0139089 -0.0027541 0.0418252 -0.204195 0.0247725 -0.0211421 0.0535458 0.0544051 0.033208 -0.0036958 -0.0109802 -0.0023265 0.06905 0.0122877 0.0305219 -0.0145715 -0.2095713 0.0229722 -0.0213562 -0.0014618 0.023464 -0.1911869 0.0263679 -0.0029778 0.051279 0.0651531 -0.0690938 -0.0072099 0.0319947 0.0229174 0.071914 0.017428 0.0404434 0.0042052 0.0753023 0.04647 -0.0678676 0.0121878 -0.0591343 -0.0716739 0.0338049 -0.1307982 -0.0775687 -0.2361261 -0.0051337 -0.0923616 -0.0017429 -0.0657365 -0.0303193 -0.0222241 -0.021151 -0.021075 0.067768 0.0046866 0.0794211 0.017341 0.0853435 -0.03215 -0.0410088 -0.0250217 0.1415627 -0.2452578 -0.2086628 0.0556046 0.0408904 0.0867322 0.0571753 -0.0325724 0.0625052 -0.0339463 0.0738411 0.0862834 0.0307366 -0.0212373 -0.0371789 -0.1759854 0.0421694 -0.0164868 0.0663157 0.065756 0.0849967 -0.0141786 0.0429128 -0.0237532 0.0778783 0.0229886 -0.0240339 0.0011535 -0.1807536 0.2550525 0.0133643 -0.0097817 0.0115484 0.2226118 0.0221974 -0.0098877 0.023048 0.2517887 0.2272162 0.0050689 0.0218907 0.0083105 0.2573584 -0.0027498 0.0236765 -0.0005751 0.2533121 unknown
polarizability: 127.4367416|-11.4175643|122.7037179|-6.0006102|-5.5684639|81.6974101 unknown
InChI: InChI=1S/C10H15N/c1-4-7-10-11(8-5-2)9-6-3/h2-3H,4,7-10H2,1H3
charge 0 multiplicity 1
26 atoms
N  -0.510044 0.08738 -0.066894
C  0.843978 -0.316834 -0.536187
C  1.989654 0.43854 0.16811
C  3.379411 -0.10277 -0.241293
C  -1.566552 -0.896624 -0.440637
C  -0.87141 1.454108 -0.535427
C  4.537097 0.650656 0.448427
C  -1.359944 -2.226679 0.160968
C  -2.141207 1.956353 0.022612
C  -1.217944 -3.355359 0.635855
C  -3.20036 2.410702 0.459655
H  0.943497 -0.201341 -1.648433
H  0.949914 -1.394669 -0.314605
H  1.851079 0.339442 1.261842
H  1.953021 1.522813 -0.062585
H  3.494635 -0.030016 -1.34243
H  3.438787 -1.181697 0.007915
H  -2.535058 -0.49117 -0.091374
H  -1.649428 -1.019378 -1.552754
H  -0.060417 2.140576 -0.232872
H  -0.93456 1.50546 -1.655566
H  5.52017 0.247885 0.143138
H  4.518637 1.726918 0.19247
H  4.463964 0.567006 1.548912
H  -1.091754 -4.333226 1.062879
H  -4.117768 2.804225 0.857374
