program: Gaussian 09
title: 000234403
version: EM64L-G09RevD.01
frameworkgroup: C1[X(C20H16N2S2)]
method: RPBEPBE
basis: SDD
operation: Freq
keyword: #p
keyword: freq=noraman
keyword: PBEPBE/SDD
title: #p freq=noraman PBEPBE/SDD
converged: YES YES NO NO
title: Mulliken charges:
elementType: S S N N C C C C C C C C C C C C C C C C C C C C H H H H H H H H H H H H H H H H
charge: 0.186372 0.278108 -0.201562 -0.013425 0.387890 0.439592 -0.714936 -0.365064 -0.358508 -0.344857 -0.383171 -0.482009 -0.354089 0.386031 -0.215514 -0.210115 -0.238336 -0.205688 -0.255342 -0.247832 -0.275525 -0.344486 -0.242362 -0.211739 0.339709 0.291503 0.263363 0.268098 0.253238 0.241046 0.227401 0.229856 0.227652 0.228735 0.230791 0.231275 0.244945 0.249840 0.229720 0.229394
chargesum: 0.00000
title: Mulliken charges with hydrogens summed into heavy atoms:
elementType: S S N N C C C C C C C C C C C C C C C C C C C C
charge: 0.186372 0.278108 -0.201562 -0.013425 0.387890 0.439592 -0.083724 -0.101701 -0.090410 -0.091619 -0.142125 -0.482009 -0.354089 0.386031 0.011887 0.019742 -0.010684 0.023048 -0.024551 -0.016558 -0.030580 -0.094646 -0.012642 0.017655
polarizability: 4.13618720e+02 -4.53343355e+01 2.53331156e+02 6.60742659e+00 -2.32129760e+01 1.81844293e+02
1716.lowfreq: -7.5800 -0.0013 0.0010 0.0022 1.4034 6.4340 11.4313 18.7905 22.1478
frequency: 11.2809 18.6302 22.0384 42.4754 57.7828 60.0535 85.3031 91.3550 102.8446 156.5119 184.8603 216.9604 238.6898 250.8848 287.0061 311.0368 357.0835 363.6402 383.1906 407.0249 407.9164 411.7734 429.0054 456.8837 485.9204 487.6380 513.5267 554.2384 573.3181 581.2707 592.0349 596.7960 612.9008 614.3329 617.9139 677.9186 694.5270 698.1005 720.9914 729.4456 761.6809 763.0782 773.3351 829.0224 832.0459 839.0496 843.8576 859.2916 900.4147 906.5518 916.2109 941.0599 967.2477 973.9487 975.2956 980.4909 983.4839 987.5262 988.4529 993.1434 1016.9549 1023.4352 1029.1417 1039.9359 1082.5465 1092.3351 1118.0222 1125.7380 1168.1918 1172.7743 1173.8444 1185.5477 1190.8405 1197.8288 1219.6023 1227.6695 1272.7913 1286.3946 1308.3879 1333.3203 1344.4230 1375.4952 1377.7516 1387.6141 1431.7733 1440.0847 1443.0211 1448.3709 1461.3627 1469.4899 1482.1860 1486.7188 1568.5139 1586.1572 1595.1210 1600.9190 1606.2509 1614.7560 3057.4307 3128.3773 3129.6413 3134.9381 3135.0828 3136.8512 3148.3823 3148.9402 3149.7640 3155.8928 3158.0100 3159.1730 3163.2891 3170.5741 3171.0684 3173.9687
redmass: 6.4823 6.4562 4.6040 5.2959 6.7868 4.1018 5.7239 4.9105 7.8296 6.7152 5.8324 4.6945 4.9984 6.4387 6.5927 5.2558 11.6873 3.4956 4.9570 4.0977 3.8114 3.1086 3.1124 4.0448 7.2315 4.7521 6.3289 4.1848 6.6145 4.9906 4.5396 5.6078 7.2948 7.3508 6.1882 7.1082 2.0033 2.0282 3.8509 2.5644 1.7415 1.5691 1.9424 2.5500 1.3259 4.8683 1.3258 1.3885 1.4539 9.2934 1.4040 1.3857 1.4053 1.3764 1.8692 1.3163 5.4826 1.3186 6.1022 1.3132 2.2031 2.3243 2.0824 5.3533 1.5922 1.6093 1.5359 3.1608 1.1223 1.0523 1.0502 1.1249 1.4136 1.1539 1.6195 2.1996 1.6186 2.0736 1.4796 1.6021 1.7708 4.6699 6.9377 9.3624 2.8866 2.3131 2.6210 2.1332 8.7081 1.2174 2.4206 2.2921 6.2854 6.1408 6.5916 7.1411 6.0787 6.0573 1.0588 1.0848 1.0848 1.0883 1.0855 1.0883 1.0942 1.0902 1.0930 1.1100 1.0969 1.0960 1.0954 1.1014 1.1013 1.1000
irintensity: 0.1127 0.0489 0.6199 0.5323 2.2940 1.2051 0.6643 0.0227 0.9393 10.5251 1.9049 6.4560 1.2518 7.0682 0.0981 2.3244 0.5226 12.0168 16.0666 74.7325 47.5753 14.0915 7.8917 53.9201 30.5773 106.4776 1.1521 71.7068 28.1081 0.9891 2.1180 4.1937 18.9380 6.8875 1.0461 4.5627 49.1219 34.1425 17.3794 20.4781 93.5951 80.3521 12.1674 29.7996 0.8801 5.7303 1.5853 1.1211 21.8203 269.0910 2.3265 2.6249 2.9344 0.6823 24.1483 0.0704 0.7450 0.8435 0.2322 0.0316 6.6041 2.7172 8.9308 10.6484 12.6552 6.3891 5.4377 83.5660 0.6855 0.6281 0.8079 13.7617 49.9733 21.9701 171.1960 124.9470 15.1238 102.7473 17.6104 98.3621 40.8867 6.8753 4.4674 0.6057 56.5237 5.9014 14.2824 4.9057 254.0617 16.0291 90.4314 146.4477 1.2572 13.3915 6.4987 1.2467 90.2696 70.4107 24.8574 7.2255 2.3750 5.1427 1.7044 3.4849 13.0890 10.7166 26.8601 25.5727 32.2848 8.7552 19.4580 19.8893 8.7035 22.1453
temp: 298.150 k
press: 1.00000 atm
elementType: 16 16 7 7 6 6 6 6 6 6 6 6 6 6 6 6 6 6 6 6 6 6 6 6 1 1 1 1 1 1 1 1 1 1 1 1 1 1 1 1
symmnumber: 1
zpe: 798070.6 jmol-1
zpe.correction: 0.303969 hartree
zpe.thermalcorrener: 0.324488 hartree
zpe.thermalcorrenthalpy: 0.325432 hartree
zpe.thermalcorrgfe: 0.250671 hartree
zpe.sumelectzpe: -1675.695504 hartree
zpe.sumelectthermal: -1675.674985 hartree
zpe.sumelectthermalent: -1675.674040 hartree
zpe.sumelectthermalfe: -1675.748801 hartree
dipole: 0.5670 1.9681 -0.5963
dipole: 2.1332
quadrupole: -133.7609 -146.0482 -151.8407
quadrupole: -5.4226 2.0548 -0.8000
quadrupole: 10.1224 -2.1649 -7.9575 -5.4226 2.0548 -0.8000
hfenergy: -1675.9994727 hartree
pointgroup: C01 [X(C20H16N2S2)]
dipole: 0.3967451 -0.5249368 0.5209709 debye
polarizability: 375.1920235|85.1959274|263.6308044|-10.9816879|-47.3485227|209.9713419 unknown
InChI: InChI=1S/C20H16N2S2/c1-3-9-16(10-4-1)22(17-11-5-2-6-12-17)15-23-20-21-18-13-7-8-14-19(18)24-20/h1-14H,15H2
charge 0 multiplicity 1
40 atoms
S  -0.571069 1.712306 -1.22647
S  -3.277814 0.416845 -2.121589
N  1.703739 0.987494 0.440939
N  -2.326404 0.288268 0.401642
C  2.819962 1.796994 0.044735
C  1.814514 -0.4568 0.46762
C  0.414249 1.564557 0.550247
C  4.145963 1.376872 0.344537
C  2.444203 -1.149648 -0.597483
C  2.623712 3.047849 -0.601578
C  1.260773 -1.185659 1.549083
C  -2.029002 0.769459 -0.787159
C  -4.237097 -0.457148 -0.848981
C  -3.552478 -0.407371 0.410411
C  5.243295 2.191101 0.00221
C  2.525111 -2.558042 -0.571303
C  3.731624 3.858725 -0.931858
C  1.334124 -2.595367 1.561906
C  5.047353 3.439283 -0.636435
C  1.968955 -3.28807 0.505342
C  -5.473561 -1.113469 -0.992078
C  -4.128568 -1.031545 1.541549
C  -6.034285 -1.732492 0.149537
C  -5.36701 -1.690387 1.402517
H  -0.301866 0.946801 1.109552
H  0.438727 2.603972 0.900984
H  4.310123 0.422683 0.854408
H  2.8577 -0.586232 -1.43986
H  1.618129 3.388109 -0.869192
H  0.787999 -0.652058 2.380684
H  6.256547 1.852929 0.246601
H  3.008538 -3.08582 -1.400789
H  3.560644 4.817872 -1.433302
H  0.902958 -3.150935 2.401839
H  5.903511 4.069837 -0.897668
H  2.027192 -4.381678 0.51914
H  -5.992771 -1.149216 -1.95464
H  -3.604557 -0.990479 2.50112
H  -6.995708 -2.2497 0.06186
H  -5.821755 -2.176345 2.272418
