program: Gaussian 09
title: 000234366
version: EM64L-G09RevD.01
frameworkgroup: C1[X(C14H27N)]
method: RPBEPBE
basis: SDD
operation: Freq
keyword: #pfreq=noraman
keyword: PBEPBE/SDD
title: #p freq=noraman PBEPBE/SDD
converged: YES YES NO NO
title: Mulliken charges:
elementType: N C C C C C C C C C C C C C C H H H H H H H H H H H H H H H H H H H H H H H H H H H
charge: -0.104932 -0.316004 -0.314058 -0.367336 -0.373521 -0.414798 -0.344819 -0.359604 -0.347965 -0.491006 -0.687297 -0.684494 -0.081647 -0.695305 0.011772 0.170481 0.221358 0.169099 0.202341 0.219510 0.189769 0.219552 0.194524 0.209865 0.230365 0.214020 0.182371 0.201649 0.195611 0.195256 0.189850 0.226124 0.233740 0.206702 0.209993 0.218073 0.207451 0.208142 0.220289 0.210718 0.209363 0.214797
chargesum: 0.00000
title: Mulliken charges with hydrogens summed into heavy atoms:
elementType: N C C C C C C C C C C C C C C
charge: -0.104932 0.075835 0.057382 0.041943 0.040554 0.025433 0.051572 0.037657 0.037140 -0.031143 -0.052528 -0.048612 -0.081647 -0.060427 0.011772
polarizability: 1.96900832e+02 -1.04465231e+01 1.53325126e+02 -9.21545663e+00 4.11406541e+00 1.35028501e+02
1716.lowfreq: -16.6719 -7.2082 -0.0007 -0.0006 0.0005 4.8069 6.7615 16.8579 26.2215
frequency: -8.2210 16.7418 25.1813 47.1233 53.2110 57.8907 66.8330 74.4967 101.6498 117.7384 140.6229 167.6519 190.6945 203.6163 212.9405 214.2082 225.5281 253.8715 273.4297 304.7193 319.6268 354.8656 366.7687 377.3708 388.2698 490.6683 509.2833 550.4679 722.8577 740.6522 747.3121 751.4991 791.4075 809.7141 834.9138 870.3798 874.2164 899.9641 908.6193 913.1838 924.0900 970.2500 975.5093 1030.4892 1043.1544 1046.2758 1061.5560 1076.9625 1086.3269 1105.4564 1105.9104 1115.4543 1123.1852 1160.4354 1166.9206 1190.6063 1198.6719 1213.8740 1242.0143 1248.0441 1249.8293 1269.2720 1277.6318 1283.4237 1285.7085 1290.5367 1306.9673 1313.2414 1320.3040 1335.1942 1357.4458 1358.4101 1369.8227 1378.4132 1386.3501 1390.4915 1391.0475 1454.2873 1458.9687 1460.8421 1467.1072 1467.5864 1468.9613 1473.7800 1475.6042 1476.5057 1476.7411 1476.7735 1478.6384 1486.7456 1487.5961 1488.6374 2277.9976 2807.7585 2825.3634 2844.2810 2957.9866 2963.7000 2966.4719 2972.1627 2972.6252 2972.9098 2975.0556 2985.9029 2986.3320 2999.7617 3013.1759 3014.1605 3021.2670 3023.1356 3028.9043 3042.9989 3045.0965 3045.6909 3068.9293 3071.1265 3071.4303 3072.2145 3074.4420 3075.9709
redmass: 2.9487 3.1630 2.7490 2.2503 2.7675 1.6962 2.4240 1.8701 2.7260 2.9500 2.4876 2.6600 2.0892 2.1690 1.1797 1.2913 1.1351 2.5291 2.8099 3.3506 2.9129 3.4131 3.0059 2.9195 3.4402 3.7036 3.6510 3.4973 1.2454 1.5428 1.1220 1.1608 1.7199 2.7807 1.5922 1.3037 1.2751 1.5320 1.7468 1.9352 1.5399 1.8740 1.9311 2.8815 2.7734 2.8024 2.5254 2.1012 2.0417 1.9513 1.7540 2.1174 2.1156 2.1382 2.2938 2.2916 1.4074 1.3496 1.2508 1.2662 1.3032 1.2555 1.2390 1.1322 1.0606 1.1321 1.3433 1.3977 1.3894 1.4266 1.4303 1.5785 1.3815 1.4378 1.2184 1.2162 1.2293 1.0864 1.0823 1.0760 1.0692 1.0722 1.0714 1.0434 1.0582 1.0578 1.0678 1.0466 1.0442 1.0839 1.0823 1.0823 11.7331 1.0716 1.0714 1.0703 1.0598 1.0591 1.0603 1.0362 1.0357 1.0359 1.0618 1.0624 1.0624 1.0966 1.0986 1.0835 1.1015 1.0865 1.0884 1.0986 1.1042 1.0964 1.1007 1.0995 1.1013 1.1011 1.0989 1.0988
irintensity: 0.0444 0.1484 0.0961 0.0882 0.0961 0.2881 0.0241 0.0376 0.2572 2.8954 1.2569 0.3953 3.0137 1.0519 0.5686 0.9456 0.3784 6.9117 1.5105 0.2549 1.0296 0.9904 3.7980 0.3185 0.0901 6.3429 0.7156 1.3386 13.6761 1.8449 8.0204 6.5728 4.1994 16.9852 2.1300 2.0691 3.0155 4.1265 9.1286 1.5389 1.5499 9.5287 3.2001 24.4080 5.7568 4.5818 28.8185 2.6200 31.9101 7.0630 1.0870 3.2137 4.7713 10.3778 3.4389 10.5412 1.1639 1.2931 12.6998 5.6805 5.7406 0.6247 1.1765 8.8215 0.8227 8.9693 1.4979 2.7257 10.0230 3.7424 20.7570 3.8625 7.5205 6.1248 11.0915 22.3258 8.2300 11.0170 4.1560 1.8171 0.4123 0.0508 0.2913 12.1771 3.0112 2.2726 1.1671 14.5661 12.3208 17.1748 19.5465 8.6548 4.3874 58.4481 67.4707 169.8912 0.9988 14.7189 40.5908 38.8386 53.3029 34.2509 84.5824 26.7553 27.1806 2.9797 24.0785 12.3235 8.0440 11.7319 9.4402 4.9246 79.8757 6.1269 94.3759 62.2566 83.7777 79.9727 60.0144 51.8177
temp: 298.150 k
press: 1.00000 atm
elementType: 7 6 6 6 6 6 6 6 6 6 6 6 6 6 6 1 1 1 1 1 1 1 1 1 1 1 1 1 1 1 1 1 1 1 1 1 1 1 1 1 1 1
symmnumber: 1
zpe: 992273.0 jmol-1
zpe.correction: 0.377937 hartree
zpe.thermalcorrener: 0.397478 hartree
zpe.thermalcorrenthalpy: 0.398423 hartree
zpe.thermalcorrgfe: 0.327142 hartree
zpe.sumelectzpe: -603.123953 hartree
zpe.sumelectthermal: -603.104411 hartree
zpe.sumelectthermalent: -603.103467 hartree
zpe.sumelectthermalfe: -603.174748 hartree
dipole: -0.4259 0.0232 -0.6632
dipole: 0.7885
quadrupole: -90.5882 -94.6804 -96.1412
quadrupole: -2.3551 -4.8951 0.8669
quadrupole: 3.2151 -0.8771 -2.3380 -2.3551 -4.8951 0.8669
hfenergy: -603.5018896 hartree
pointgroup: C01 [X(C14H27N1)]
dipole: -0.1662798 0.0053074 0.2618244 debye
polarizability: 194.7641116|14.9333104|156.2779701|7.2582149|2.5487052|134.2123771 unknown
InChI: InChI=1S/C14H27N/c1-4-7-8-9-10-11-14-15(12-5-2)13-6-3/h4-9,12-14H2,1-3H3
charge 0 multiplicity 1
42 atoms
N  2.138652 0.368183 -0.064628
C  2.03307 -0.899952 0.707073
C  3.263576 1.231709 0.382199
C  3.08332 -1.94888 0.284594
C  3.772808 2.198782 -0.709437
C  0.858523 1.135131 -0.080007
C  -4.190034 0.094285 -0.190345
C  -3.53775 -1.172468 -0.784713
C  -5.302544 -0.223678 0.834396
C  -2.39453 -0.863239 -1.794568
C  2.952019 -3.257244 1.094535
C  4.960373 3.052861 -0.214819
C  -0.269823 0.411645 -0.695133
C  -5.956723 1.045131 1.423165
C  -1.242666 -0.161616 -1.19504
H  2.105466 -0.719078 1.811724
H  1.027429 -1.319607 0.517534
H  2.989729 1.818774 1.299399
H  4.102256 0.573124 0.673537
H  2.955135 -2.147579 -0.795868
H  4.106045 -1.54169 0.410342
H  4.067318 1.600296 -1.591726
H  2.95618 2.869004 -1.042505
H  0.55784 1.447272 0.956653
H  1.029919 2.069974 -0.646235
H  -3.407312 0.711942 0.293875
H  -4.612103 0.710823 -1.011768
H  -3.135794 -1.800322 0.034948
H  -4.308071 -1.777105 -1.305253
H  -4.875425 -0.835791 1.654981
H  -6.079507 -0.851232 0.350927
H  -2.802129 -0.25386 -2.627014
H  -2.038957 -1.81004 -2.248546
H  3.098331 -3.075536 2.176418
H  1.950295 -3.708541 0.963212
H  3.701895 -4.002903 0.773527
H  4.673833 3.672378 0.656367
H  5.810316 2.414568 0.092931
H  5.320622 3.732911 -1.007744
H  -5.206239 1.674151 1.937939
H  -6.41742 1.659193 0.626356
H  -6.746224 0.792725 2.154815
