program: Gaussian 09
title: 000234359
version: EM64L-G09RevD.01
frameworkgroup: C1[X(C12H23N)]
method: RPBEPBE
basis: SDD
operation: Freq
keyword: #pfreq=noraman
keyword: PBEPBE/SDD
title: #p freq=noraman PBEPBE/SDD
converged: YES YES NO NO
title: Mulliken charges:
elementType: N C C C C C C C C C C C C H H H H H H H H H H H H H H H H H H H H H H H
charge: -0.111116 -0.019690 -0.014254 -0.447098 -0.678892 -0.754587 -0.723015 -0.685639 -0.017825 -0.443852 -0.046456 -0.346524 -0.687202 0.184946 0.191849 0.254179 0.215224 0.197330 0.220503 0.214972 0.229903 0.219686 0.221897 0.215422 0.237415 0.209124 0.223987 0.186533 0.237927 0.223704 0.222434 0.211365 0.214281 0.224576 0.209294 0.209601
chargesum: 0.00000
title: Mulliken charges with hydrogens summed into heavy atoms:
elementType: N C C C C C C C C C C C C
charge: -0.111116 0.165256 0.177595 0.022305 -0.046088 -0.083101 -0.061055 -0.037192 -0.017825 0.002285 -0.046456 0.079122 -0.043731
polarizability: 1.82359181e+02 5.65504097e+00 1.22489189e+02 -2.10279817e+00 2.05261992e+00 1.15353901e+02
1716.lowfreq: -20.4434 -15.6677 -3.9345 -0.0007 -0.0005 0.0001 5.2482 28.8371 43.8332
frequency: -20.2150 28.7532 43.7856 58.8714 71.2345 85.9997 126.5154 190.5981 196.5135 208.8787 219.7212 223.5017 230.7409 261.3695 276.4336 291.8269 317.7118 324.8552 345.5087 371.6729 399.2387 421.4470 436.1314 468.8456 506.6629 557.7884 709.3701 736.0205 785.6366 834.6217 859.1685 880.1861 890.2776 906.8270 916.0624 932.4592 938.9113 954.8162 1010.7944 1042.9162 1050.1211 1093.1582 1095.1882 1106.4036 1131.3585 1134.6436 1164.2470 1173.5920 1183.0244 1201.6948 1223.8331 1247.7052 1274.6946 1282.0451 1310.4398 1314.8204 1334.3903 1338.8639 1346.4748 1369.7092 1379.2323 1387.3383 1390.2891 1390.4807 1395.6679 1454.6314 1456.7662 1458.9178 1461.8809 1469.3476 1473.0750 1475.2379 1478.5110 1480.7076 1485.2583 1485.8613 1491.4602 1497.0243 2275.2400 2830.5519 2839.6590 2959.2877 2972.9380 2973.2655 2977.2200 2979.7083 2981.2178 2994.9612 3001.8539 3002.0921 3040.4317 3044.1627 3064.7267 3070.6786 3074.3390 3075.4377 3075.7786 3078.4221 3080.5091 3081.4408 3087.9576 3105.5912
redmass: 2.1421 3.1630 2.6653 2.5328 2.7077 2.6226 3.0139 1.0919 1.0938 3.0610 2.4588 1.6338 1.5749 1.2227 1.8866 2.2532 2.6629 1.5035 2.8151 3.1866 2.2917 3.0337 3.1681 2.6239 4.0671 2.9169 3.0332 1.1032 3.5405 2.9231 1.2294 2.1471 2.0196 1.2977 1.1874 1.3259 1.6360 1.6371 2.1258 2.6207 2.9326 2.0033 1.4725 1.7656 2.1899 2.4418 2.5812 2.2423 2.2776 2.7070 1.3177 1.1327 1.3764 1.0974 1.3496 1.3495 1.3092 1.4969 1.2893 1.2167 1.2305 1.2188 1.2811 1.2152 1.2093 1.0524 1.0613 1.0793 1.0573 1.0468 1.0556 1.0495 1.0439 1.0479 1.0744 1.0561 1.0520 1.0504 11.7166 1.0748 1.0780 1.0581 1.0357 1.0358 1.0357 1.0381 1.0365 1.0609 1.0832 1.0987 1.0833 1.1016 1.0987 1.0989 1.1022 1.0976 1.0988 1.0984 1.0999 1.0994 1.0993 1.0990
irintensity: 0.0512 0.5037 0.4546 0.2730 0.1979 0.0872 0.3954 0.6449 0.2705 0.1982 2.1493 3.7336 4.8149 0.2043 2.8985 0.7499 1.5983 2.0388 0.4823 1.1803 2.2572 3.7598 1.7864 2.7858 1.4618 2.4716 11.9915 7.4878 2.4679 4.6581 0.9809 2.0240 7.9268 0.9272 3.2121 0.4552 7.8317 1.5191 12.9367 4.5513 2.8155 9.5839 1.3930 22.2004 13.3419 8.7380 2.8997 54.2481 18.3172 68.8495 0.1132 4.5321 6.9065 0.1331 4.1125 22.5834 28.1348 2.2629 12.4954 24.1918 22.9237 17.9915 4.5929 11.6039 19.6985 2.8812 11.3435 1.3564 3.5196 0.9965 2.4273 5.9605 13.8490 5.3546 11.8825 6.2430 15.9439 10.5978 3.3142 41.1816 129.4068 33.5163 33.0614 43.4472 32.7333 39.1968 18.7544 30.7949 30.8139 6.2484 13.8400 2.2325 27.4621 5.3924 76.5397 34.5206 48.5711 71.7048 14.9231 67.7339 52.9602 31.9668
temp: 298.150 k
press: 1.00000 atm
elementType: 7 6 6 6 6 6 6 6 6 6 6 6 6 1 1 1 1 1 1 1 1 1 1 1 1 1 1 1 1 1 1 1 1 1 1 1
symmnumber: 1
zpe: 844672.7 jmol-1
zpe.correction: 0.321719 hartree
zpe.thermalcorrener: 0.338253 hartree
zpe.thermalcorrenthalpy: 0.339197 hartree
zpe.thermalcorrgfe: 0.277529 hartree
zpe.sumelectzpe: -524.673499 hartree
zpe.sumelectthermal: -524.656965 hartree
zpe.sumelectthermalent: -524.656021 hartree
zpe.sumelectthermalfe: -524.717689 hartree
dipole: -0.1699 0.0128 -0.5951
dipole: 0.6190
quadrupole: -73.2985 -81.6612 -84.7768
quadrupole: 0.5866 0.9745 0.0817
quadrupole: 6.6137 -1.7490 -4.8647 0.5866 0.9745 0.0817
hfenergy: -524.9952181 hartree
pointgroup: C01 [X(C12H23N1)]
dipole: 0.0721168 0.0159504 0.2320568 debye
polarizability: 182.2299711|-5.861587|122.2925497|-3.346376|-2.2445773|115.6797506 unknown
InChI: InChI=1S/C12H23N/c1-6-7-8-9-10-13(11(2)3)12(4)5/h11-12H,6-7,10H2,1-5H3
charge 0 multiplicity 1
36 atoms
N  1.600925 -0.034272 -0.153154
C  3.057092 -0.412607 -0.244384
C  1.419532 1.456945 -0.008622
C  0.808657 -0.861205 0.801254
C  3.607669 -0.015125 -1.637167
C  3.325026 -1.919675 -0.028688
C  1.26911 1.948887 1.457925
C  0.278314 1.982528 -0.909334
C  -0.655409 -0.668904 0.743293
C  -3.355885 -0.448299 0.740953
C  -1.88717 -0.582547 0.766252
C  -3.925719 -0.216049 -0.688173
C  -5.461707 -0.071762 -0.679661
H  3.643084 0.139303 0.536171
H  2.357015 1.903492 -0.391454
H  1.004281 -1.921096 0.564824
H  1.126164 -0.715172 1.865879
H  4.700215 -0.183743 -1.68493
H  3.116728 -0.62695 -2.41523
H  3.420125 1.045905 -1.877055
H  3.109369 -2.257046 1.000204
H  4.39399 -2.121496 -0.222528
H  2.735183 -2.530775 -0.737432
H  1.294419 3.053946 1.484268
H  0.309855 1.624644 1.8993
H  2.093552 1.578484 2.096799
H  0.44317 1.656241 -1.951077
H  0.242349 3.089105 -0.882966
H  -0.698015 1.591393 -0.580308
H  -3.667591 0.392525 1.394091
H  -3.819869 -1.36056 1.169097
H  -3.460106 0.69168 -1.117267
H  -3.62427 -1.060976 -1.335541
H  -5.85211 0.093176 -1.700185
H  -5.946234 -0.981221 -0.276406
H  -5.779637 0.784326 -0.054751
