program: Gaussian 09
title: 000234357
version: EM64L-G09RevD.01
frameworkgroup: C1[X(C10H19N)]
method: RPBEPBE
basis: SDD
operation: Freq
keyword: #pfreq=noraman
keyword: PBEPBE/SDD
title: #p freq=noraman PBEPBE/SDD
converged: YES YES NO NO
title: Mulliken charges:
elementType: N C C C C C C C C C C H H H H H H H H H H H H H H H H H H H
charge: -0.113265 -0.018586 -0.017676 -0.457988 -0.676549 -0.754097 -0.720914 -0.684637 0.056307 -0.060039 -0.750214 0.185488 0.192162 0.253166 0.212858 0.196775 0.220600 0.215110 0.228912 0.219514 0.221737 0.215397 0.235049 0.209394 0.225061 0.186930 0.238342 0.246063 0.247470 0.247628
chargesum: 0.00000
title: Mulliken charges with hydrogens summed into heavy atoms:
elementType: N C C C C C C C C C C
charge: -0.113265 0.166903 0.174486 0.008036 -0.044064 -0.083934 -0.061074 -0.034303 0.056307 -0.060039 -0.009052
polarizability: 1.50218486e+02 -2.85528243e+00 1.05108873e+02 3.98070783e+00 -1.72284526e+00 9.43110815e+01
1716.lowfreq: -9.1259 -5.2998 0.0000 0.0004 0.0009 6.2963 8.9108 33.9638 60.6026
frequency: 2.5288 33.4867 60.3447 70.9049 89.6341 178.5912 196.2023 207.4098 219.8784 228.9781 258.9414 277.1286 305.2922 307.1497 327.0359 365.6458 374.4915 397.1016 433.1155 454.4002 470.7638 547.2135 709.4757 768.9085 834.0498 885.0836 907.5314 914.3519 932.0524 937.2382 955.6653 1011.4477 1030.4694 1032.2994 1046.9496 1106.8752 1131.4759 1134.1648 1170.4330 1173.9173 1183.4099 1203.4269 1249.2572 1308.9031 1316.1402 1329.8525 1347.2580 1370.5347 1378.3867 1387.9763 1389.6882 1395.3566 1402.0732 1456.6109 1458.2673 1461.8005 1462.2637 1464.4927 1469.5988 1476.1701 1480.6586 1485.8810 1490.6819 1497.1175 2284.2843 2832.3790 2841.4950 2971.4735 2972.5267 2977.2924 2980.8366 2981.2395 2998.5558 3040.9967 3057.2058 3060.3090 3064.9196 3071.3117 3076.3612 3078.2759 3080.4443 3081.1894 3087.5685 3107.6361
redmass: 1.0142 3.0025 2.9493 2.8347 2.7392 2.4996 1.1833 1.1290 2.6464 2.8188 1.2616 1.8209 2.0904 2.4537 1.5876 2.9976 3.1837 2.2245 2.9673 3.4514 2.7211 2.4489 2.9893 4.0856 2.9836 2.2235 1.2930 1.1620 1.3351 1.5634 1.6774 2.0398 1.5010 1.4358 2.2023 1.7587 2.2391 2.4110 3.0174 2.2204 2.2927 2.9301 1.1278 1.3514 1.3481 1.3287 1.2883 1.2169 1.2386 1.2206 1.2710 1.2150 1.2213 1.0545 1.0553 1.0418 1.0564 1.0421 1.0461 1.0512 1.0468 1.0542 1.0522 1.0522 11.6468 1.0784 1.0745 1.0350 1.0357 1.0357 1.0369 1.0384 1.0825 1.0832 1.0981 1.0987 1.0989 1.0989 1.0974 1.0987 1.0998 1.0993 1.0993 1.0988
irintensity: 0.0067 0.4121 0.4887 0.5489 1.8656 1.3180 2.1366 1.4559 0.5564 8.8479 1.6440 4.9197 1.5783 1.6560 1.3333 0.5388 1.8633 1.7451 4.6326 0.9130 2.0370 2.6601 12.1620 1.4504 4.2134 5.0126 1.1550 2.6835 1.0898 7.1152 2.6571 13.7776 4.6225 1.1716 3.4834 25.2706 16.8774 3.9922 2.2381 54.3273 16.4407 72.7329 5.3040 5.0991 21.1732 28.0985 10.1469 24.6666 24.2287 19.0384 5.0767 16.6137 1.6006 2.8720 10.6804 10.8666 2.6670 13.2099 2.1707 3.4363 6.4013 6.8710 16.7731 7.5122 2.3159 43.5905 125.8379 47.3960 29.4262 33.1204 46.6857 11.7917 29.7214 14.9991 14.9856 15.6272 30.3279 6.8152 30.8457 61.6817 13.2184 75.5815 54.4667 31.6297
temp: 298.150 k
press: 1.00000 atm
elementType: 7 6 6 6 6 6 6 6 6 6 6 1 1 1 1 1 1 1 1 1 1 1 1 1 1 1 1 1 1 1
symmnumber: 1
zpe: 697427.3 jmol-1
zpe.correction: 0.265636 hartree
zpe.thermalcorrener: 0.280497 hartree
zpe.thermalcorrenthalpy: 0.281441 hartree
zpe.thermalcorrgfe: 0.221210 hartree
zpe.sumelectzpe: -446.227740 hartree
zpe.sumelectthermal: -446.212879 hartree
zpe.sumelectthermalent: -446.211935 hartree
zpe.sumelectthermalfe: -446.272166 hartree
dipole: 0.0217 -0.0350 0.7821
dipole: 0.7831
quadrupole: -60.6583 -68.9202 -71.6765
quadrupole: -0.3290 2.1338 -0.1562
quadrupole: 6.4267 -1.8352 -4.5915 -0.3290 2.1338 -0.1562
hfenergy: -446.4933759 hartree
pointgroup: C01 [X(C10H19N1)]
dipole: 0.028687 -0.0020981 0.3067667 debye
polarizability: 150.4485369|-3.3153462|105.0237536|0.3863406|-1.9603712|94.1661503 unknown
InChI: InChI=1S/C10H19N/c1-6-7-8-11(9(2)3)10(4)5/h9-10H,8H2,1-5H3
charge 0 multiplicity 1
30 atoms
N  0.777287 -0.01506 -0.127564
C  2.239714 -0.357241 -0.000731
C  0.530839 1.460443 0.069049
C  -0.139624 -0.915134 0.626717
C  2.991752 0.124081 -1.267169
C  2.51538 -1.866375 0.186176
C  0.133039 1.858251 1.517709
C  -0.468209 2.017964 -0.970518
C  -1.576506 -0.757567 0.317756
C  -2.79381 -0.703166 0.121169
C  -4.239657 -0.612717 -0.137457
H  2.677216 0.167306 0.88838
H  1.504128 1.947405 -0.132466
H  0.130921 -1.95439 0.372951
H  -0.020295 -0.824542 1.736919
H  4.083027 -0.015347 -1.147363
H  2.649901 -0.458288 -2.141654
H  2.809521 1.191104 -1.483415
H  2.145252 -2.259085 1.149425
H  3.607465 -2.032755 0.161283
H  2.068754 -2.455474 -0.636681
H  0.120525 2.959854 1.61124
H  -0.874973 1.488219 1.776631
H  0.854068 1.465255 2.25987
H  -0.139354 1.747153 -1.988924
H  -0.528894 3.121267 -0.8959
H  -1.476452 1.600719 -0.815547
H  -4.815625 -0.566448 0.805395
H  -4.481772 0.294194 -0.72284
H  -4.600818 -1.486326 -0.711139
