program: Gaussian 09
title: 000234355
version: EM64L-G09RevD.01
frameworkgroup: C1[X(C7H7NO4)]
method: RPBEPBE
basis: SDD
operation: Freq
keyword: #pfreq=noraman
keyword: PBEPBE/SDD
title: #p freq=noraman PBEPBE/SDD
converged: YES YES NO NO
title: Mulliken charges:
elementType: O O O O N C C C C C C C H H H H H H H
charge: -0.420746 -0.392890 -0.564316 -0.215045 -0.697394 0.030148 0.241997 0.241272 0.649138 -0.610201 -0.672128 0.157028 0.248209 0.212233 0.311993 0.318428 0.407819 0.355468 0.398985
chargesum: 0.00000
title: Mulliken charges with hydrogens summed into heavy atoms:
elementType: O O O O N C C C C C C C
charge: -0.012926 -0.037422 -0.165332 -0.215045 -0.066973 0.030148 0.241997 0.241272 0.649138 -0.361992 -0.459895 0.157028
polarizability: 1.64064649e+02 1.59791818e+00 1.13112559e+02 -1.21215592e-02 5.91598398e-03 4.06562359e+01
1716.lowfreq: -7.6852 -0.0010 -0.0009 -0.0009 2.7553 6.3419 55.6933 83.6183 198.2537
frequency: 55.6792 83.6167 198.2535 215.6755 238.8947 279.9634 310.1318 366.2434 387.8053 393.2885 400.4110 406.4032 435.3320 510.8256 513.9684 543.4554 587.0236 602.0084 605.2146 632.1229 666.9809 680.1211 748.0860 787.5797 807.2960 855.4486 921.1999 998.0818 1007.2180 1067.6773 1132.5637 1173.6531 1200.6954 1229.2515 1258.1844 1360.7444 1393.7616 1423.6178 1476.2286 1551.9895 1578.0577 1645.6323 1661.8859 1679.4367 3117.6004 3121.4408 3165.1746 3553.5334 3563.6750 3564.5442 3704.2747
redmass: 10.6891 7.1730 5.9114 4.2023 7.0272 3.9063 3.9473 8.8252 5.3170 1.1080 8.3489 1.1193 1.1899 6.8488 1.1632 5.1286 6.7333 3.4379 3.9447 4.2829 2.5929 4.9841 3.4290 1.5406 1.3172 2.2877 5.7767 3.4596 2.9023 1.6547 1.6974 1.6841 1.5579 1.7821 3.0616 2.9667 3.7300 2.6770 4.5073 2.5642 5.3740 1.1817 5.3685 8.1363 1.0912 1.0667 1.0924 1.0658 1.0523 1.0579 1.1041
irintensity: 0.4565 6.0129 9.3941 0.2385 2.9345 10.5871 2.0282 1.2174 14.1855 81.0260 6.1015 4.2534 305.9349 8.6822 172.8433 38.6491 4.8229 0.8542 15.4488 0.2838 60.4700 10.9857 22.3236 6.0889 177.9836 57.1437 282.8179 18.5480 50.4556 56.5892 95.9792 36.4340 118.8583 51.7717 173.4542 10.3440 77.4392 100.0551 58.2292 26.4349 196.9104 146.1669 1006.2709 204.5777 10.5522 396.6460 4.7696 27.0402 161.0054 2.8844 25.1433
temp: 298.150 k
press: 1.00000 atm
elementType: 8 8 8 8 7 6 6 6 6 6 6 6 1 1 1 1 1 1 1
symmnumber: 1
zpe: 358054.0 jmol-1
zpe.correction: 0.136376 hartree
zpe.thermalcorrener: 0.147218 hartree
zpe.thermalcorrenthalpy: 0.148162 hartree
zpe.thermalcorrgfe: 0.100226 hartree
zpe.sumelectzpe: -625.730855 hartree
zpe.sumelectthermal: -625.720013 hartree
zpe.sumelectthermalent: -625.719069 hartree
zpe.sumelectthermalfe: -625.767005 hartree
dipole: -4.8631 0.5601 0.0108
dipole: 4.8952
quadrupole: -46.5780 -66.5565 -73.0718
quadrupole: -12.4003 0.0159 0.0149
quadrupole: 15.4908 -4.4878 -11.0030 -12.4003 0.0159 0.0149
hfenergy: -625.8672309 hartree
pointgroup: C01 [X(C7H7N1O4)]
dipole: -1.908185 -0.2357116 -0.1118365 debye
dipolederiv: -0.7806857 -0.4677255 -0.0685652 -0.405363 -1.0475731 -0.0889017 -0.0615982 -0.0918487 -0.4241302 -0.2119478 0.453613 0.05891 0.3316134 -1.1278266 -0.0692448 0.0451429 -0.0641321 -0.3902414 -0.8481007 -0.4067963 -0.0597973 -0.5786413 -1.0164109 -0.0813406 -0.07788 -0.0737232 -0.5080346 -1.1793126 0.3595852 0.003041 0.4936219 -0.752926 -0.026807 0.0188299 -0.0329513 -0.3194421 -1.7359273 0.0511733 -0.0377107 0.0668689 -0.1725303 0.0654073 -0.0364081 0.0647482 -0.7168569 -1.404401 0.0428999 -0.0489382 -0.0121865 -0.5980003 -0.0519509 -0.0548534 -0.0498187 -0.1466197 1.2170556 0.4312104 0.09401 0.0415015 1.0183259 0.0990072 0.0507592 0.1154772 0.1690059 1.0204789 -0.3631335 -0.004232 0.147659 1.1192036 0.1142104 0.0525722 0.0927129 0.1739188 1.8812825 -0.0321312 0.0683629 -0.0293484 0.6806148 0.0516618 0.0686691 0.0515134 0.2179658 -0.9071371 -0.3513085 -0.0650584 -0.4177814 -0.2389879 -0.0097361 -0.0727457 -0.0065659 -0.3149294 -0.824562 0.3911956 0.0235228 0.4164333 -0.3578604 0.0162295 0.0264582 0.0151672 -0.3406097 2.3527572 0.000156 0.0883289 -0.0352766 1.369311 0.1193693 0.0833241 0.1212263 0.2798122 0.0162837 0.0686359 0.0002148 0.0705999 -0.0212341 -0.0210398 0.0003936 -0.0211603 0.1897375 -0.0003952 -0.0633095 -0.0156909 -0.0782313 -0.0909046 -0.0360103 -0.0173325 -0.0354334 0.1943686 0.2400124 0.0060073 -0.0055813 0.0544362 0.1209278 -0.0276555 -0.0001891 -0.0297346 0.3820661 0.2344444 -0.0158342 -0.0082888 -0.0699255 0.1324764 -0.0316236 -0.014032 -0.0293216 0.3806564 0.594054 0.0233046 0.0113873 -0.0783467 0.3749363 -0.0045642 -0.0003525 -0.0000134 0.3865864 0.1075806 -0.1916003 -0.0332322 -0.1036143 0.3312387 -0.0092197 -0.0232358 -0.0132199 0.3699976 0.2285202 0.0640578 -0.0006829 0.1859809 0.2772196 -0.0077915 0.0124782 -0.0129221 0.4167487 unknown
polarizability: 163.8782127|-1.4704885|112.1864818|5.083968|7.9741668|41.7687489 unknown
InChI: InChI=1S/C7H7NO4/c8-3-1-4(9)6(7(11)12)5(10)2-3/h1-2,9-11H,8H2
charge 0 multiplicity 1
19 atoms
O  0.553856 2.337012 0.371904
O  0.472329 -2.535992 -0.180175
O  2.702245 1.077907 0.317263
O  2.845913 -1.221546 0.070244
N  -3.641115 0.062493 -0.064115
C  0.62588 -0.133036 0.09725
C  -0.0874 1.125532 0.208451
C  -0.185328 -1.308963 -0.069768
C  -2.255469 0.003662 -0.010935
C  -1.491466 1.184984 0.155077
C  -1.587099 -1.250644 -0.123407
C  2.083824 -0.235157 0.147304
H  -1.966793 2.16574 0.245395
H  -2.169671 -2.172018 -0.252259
H  -4.198771 -0.778116 -0.183538
H  -4.123794 0.952944 0.016407
H  1.555536 2.177412 0.394543
H  -0.186306 -3.268031 -0.292043
H  3.68563 0.956218 0.344303
